{"text_format":"1","workbook":"xlsx","n_sheets":6,"sheets":["無地画面","高速コマ入力処理実行ボタン","入力","特別教室コード・表示内容変更","インターフェース画面設定","呼出ファイル"],"not_rendered":{"charts":0,"images":0,"macros":1,"external_links":0,"defined_names":0,"comments":1,"pivot_tables":0},"unopened":[],"bounds":{"document_bytes":16777216,"sheet_cells":100000,"rows_first":2000,"rows_last":500,"rows_between":2000,"halvings":0,"cell_chars":16384,"cell_head_chars":4096},"cells_cut":0,"cells_raw":0,"read":"whole","date_system":"1900"}

{"sheet":"無地画面","index":0,"n_rows":0,"n_cols":0,"rows_kept":0,"cut":false,"hidden":false,"merged":[]}

{"sheet":"高速コマ入力処理実行ボタン","index":1,"n_rows":103,"n_cols":5,"rows_kept":103,"cut":false,"hidden":false,"merged":[]}
[]
[]
[]
[]
[]
[]
[]
[]
[]
[]
[]
[]
[]
[]
[]
[]
[]
[]
[]
[]
[]
[]
[]
[]
[]
[]
[]
[]
[]
[]
[]
[]
[]
[]
[]
[]
[]
[]
[]
[]
[]
[]
[]
[]
[]
[]
[]
[]
[]
[]
[]
[]
[]
[]
[]
[]
[]
[]
[]
[]
[]
[]
[]
[]
[]
[]
[]
[]
[]
[]
[]
[]
[]
[]
[]
[]
[]
[]
[]
[]
[]
[]
[]
[]
[]
[]
[]
[]
[]
[]
[]
[]
[]
[]
[]
[]
[]
[]
[]
[]
[null,null,"E4903057189AF4BA多田記一",1,"210ninn60kurasukomanyuuryokusisutemu3daitourokuver1.xlsm"]
[null,null,"BAB5D52235FC0COwner"]
[null,null,"4755C54B6B0F3FFPCUser"]

{"sheet":"入力","index":2,"n_rows":3072,"n_cols":54,"rows_kept":3072,"cut":false,"hidden":false,"merged":[[1,8,1,10],[1,11,1,17]]}
[null,null,"入力テーブル"]
[null,null,"未入力セルの総計",null,null,{"$f":"AC2224","v":38},{"$f":"TODAY()","v":"2022-10-27"},null,"年度入力→",null,null,"平成２６年度"]
["NO","教科","担当１","単位数","時数","科目","担当2","C1","C2","C3","C4","C5","C6","C7","C8","C9","C10","C11","C12","C13","C14","C15","C16","C17","C18","C19","C20","入力数","未入力"]
[null,null,null,null,null,null,null,52,42,15,24,14,34,21,43,35,62,45,51,null,null,null,null,null,null,null,null,{"$f":"COUNTA(H4:AA4)","v":12}]
[1,null,{"$f":"IF(G2238=\"\",\"\",G2238)","v":"小杉"},4,{"$f":"IF(COUNTA(H5:AA5)=0,\"\",COUNTA(H5:AA5))","v":12},"国Ⅰ","小杉","*12","*12","*12","*12","*14","*14","*14","*14","*17","*17","*17","*17",null,null,null,null,null,null,null,null,12,{"$f":"AB5-AB4","v":0}]
[null,null,null,null,null,null,null,null,null,null,null,null,null,null,null,null,null,null,null,null,null,null,null,null,null,null,null,0]
[1,null,null,null,{"$f":"IF(COUNTA(H7:AA7)=0,\"\",COUNTA(H7:AA7))","v":""},null,null,null,null,null,null,null,null,null,null,null,null,null,null,null,null,null,null,null,null,null,null,0,{"$f":"AB7-AB6","v":0}]
[null,null,null,null,null,null,null,null,null,null,null,null,null,null,null,null,null,null,null,null,null,null,null,null,null,null,null,0]
[1,null,null,null,{"$f":"IF(COUNTA(H9:AA9)=0,\"\",COUNTA(H9:AA9))","v":""},null,null,null,null,null,null,null,null,null,null,null,null,null,null,null,null,null,null,null,null,null,null,0,{"$f":"AB9-AB8","v":0}]
[null,null,null,null,null,null,null,null,null,null,null,null,null,null,null,null,null,null,null,null,null,null,null,null,null,null,null,0]
[1,null,null,null,{"$f":"IF(COUNTA(H11:AA11)=0,\"\",COUNTA(H11:AA11))","v":""},null,null,null,null,null,null,null,null,null,null,null,null,null,null,null,null,null,null,null,null,null,null,0,{"$f":"AB11-AB10","v":0}]
[null,null,null,null,null,null,null,null,null,null,null,null,null,null,null,null,null,null,null,null,null,null,null,null,null,null,null,0]
[1,null,null,null,{"$f":"IF(COUNTA(H13:AA13)=0,\"\",COUNTA(H13:AA13))","v":""},null,null,null,null,null,null,null,null,null,null,null,null,null,null,null,null,null,null,null,null,null,null,0,{"$f":"AB13-AB12","v":0}]
[null,null,null,null,null,null,null,21,14,52,31,35,45,26,16,36,55,11,61,null,null,null,null,null,null,null,null,12]
[2,null,{"$f":"IF(G2240=\"\",\"\",G2240)","v":"桜井"},4,{"$f":"IF(COUNTA(H15:AA15)=0,\"\",COUNTA(H15:AA15))","v":12},"国Ⅰ","桜井","*11","*11","*11","*11","*15","*15","*15","*15","*16","*16","*16","*16",null,null,null,null,null,null,null,null,12,{"$f":"AB15-AB14","v":0}]
[null,null,null,null,null,null,null,44,33,25,null,null,null,null,null,null,null,null,null,null,null,null,null,null,null,null,null,3]
[2," ",null,3,{"$f":"IF(COUNTA(H17:AA17)=0,\"\",COUNTA(H17:AA17))","v":3},"現文","桜井","*34","*34","*34",null,null,null,null,null,null,null,null,null,null,null,null,null,null,null,null,null,3,{"$f":"AB17-AB16","v":0}]
[null,null,null,null,null,null,null,null,null,null,null,null,null,null,null,null,null,null,null,null,null,null,null,null,null,null,null,0]
[2,null,null,null,{"$f":"IF(COUNTA(H19:AA19)=0,\"\",COUNTA(H19:AA19))","v":""},null,null,null,null,null,null,null,null,null,null,null,null,null,null,null,null,null,null,null,null,null,null,0,{"$f":"AB19-AB18","v":0}]
[null,null,null,null,null,null,null,null,null,null,null,null,null,null,null,null,null,null,null,null,null,null,null,null,null,null,null,0]
[2,null,null,null,{"$f":"IF(COUNTA(H21:AA21)=0,\"\",COUNTA(H21:AA21))","v":""},null,null,null,null,null,null,null,null,null,null,null,null,null,null,null,null,null,null,null,null,null,null,0,{"$f":"AB21-AB20","v":0}]
[null,null,null,null,null,null,null,46,null,null,null,null,null,null,null,null,null,null,null,null,null,null,null,null,null,null,null,1]
[2,null,null,null,{"$f":"IF(COUNTA(H23:AA23)=0,\"\",COUNTA(H23:AA23))","v":1},"LHR","桜井","*16",null,null,null,null,null,null,null,null,null,null,null,null,null,null,null,null,null,null,null,1,{"$f":"AB23-AB22","v":0}]
[null,null,null,null,null,null,null,23,31,11,62,25,35,61,16,null,null,null,null,null,null,null,null,null,null,null,null,8]
[3,"国",{"$f":"IF(G2242=\"\",\"\",G2242)","v":"小野島"},4,{"$f":"IF(COUNTA(H25:AA25)=0,\"\",COUNTA(H25:AA25))","v":8},"国Ⅰ","小野島","*13","*13","*13","*13","*18","*18","*18","*18",null,null,null,null,null,null,null,null,null,null,null,null,8,{"$f":"AB25-AB24","v":0}]
[null,null,null,null,null,null,null,36,21,43,53,44,12,34,26,null,null,null,null,null,null,null,null,null,null,null,null,8]
[3,null,null,4,{"$f":"IF(COUNTA(H27:AA27)=0,\"\",COUNTA(H27:AA27))","v":8},"国Ⅱ","小野島","*27","*27","*27","*27","*28","*28","*28","*28",null,null,null,null,null,null,null,null,null,null,null,null,8,{"$f":"AB27-AB26","v":0}]
[null,null,null,null,null,null,null,null,null,null,null,null,null,null,null,null,null,null,null,null,null,null,null,null,null,null,null,0]
[3,null,null,null,{"$f":"IF(COUNTA(H29:AA29)=0,\"\",COUNTA(H29:AA29))","v":""},null,null,null,null,null,null,null,null,null,null,null,null,null,null,null,null,null,null,null,null,null,null,0,{"$f":"AB29-AB28","v":0}]
[null,null,null,null,null,null,null,null,null,null,null,null,null,null,null,null,null,null,null,null,null,null,null,null,null,null,null,0]
[3,null,null,null,{"$f":"IF(COUNTA(H31:AA31)=0,\"\",COUNTA(H31:AA31))","v":""},null,null,null,null,null,null,null,null,null,null,null,null,null,null,null,null,null,null,null,null,null,null,0,{"$f":"AB31-AB30","v":0}]
[null,null,null,null,null,null,null,null,null,null,null,null,null,null,null,null,null,null,null,null,null,null,null,null,null,null,null,0]
[3,null,null,null,{"$f":"IF(COUNTA(H33:AA33)=0,\"\",COUNTA(H33:AA33))","v":""},null,null,null,null,null,null,null,null,null,null,null,null,null,null,null,null,null,null,null,null,null,null,0,{"$f":"AB33-AB32","v":0}]
[null,null,null,null,null,null,null,36,43,62,53,22,42,35,15,52,16,31,61,null,null,null,null,null,null,null,null,12]
[4,null,{"$f":"IF(G2244=\"\",\"\",G2244)","v":"榎本"},4,{"$f":"IF(COUNTA(H35:AA35)=0,\"\",COUNTA(H35:AA35))","v":12},"国Ⅱ","榎本","*23","*23","*23","*23","*24","*24","*24","*24","*25","*25","*25","*25",null,null,null,null,null,null,null,null,12,{"$f":"AB35-AB34","v":0}]
[null,null,null,null,null,null,null,44,14,null,null,null,null,null,null,null,null,null,null,null,null,null,null,null,null,null,null,2]
[4,null,null,2,{"$f":"IF(COUNTA(H37:AA37)=0,\"\",COUNTA(H37:AA37))","v":2},"国Ⅱ","榎本","*37","*37",null,null,null,null,null,null,null,null,null,null,null,null,null,null,null,null,null,null,2,{"$f":"AB37-AB36","v":0}]
[null,null,null,null,null,null,null,null,null,null,null,null,null,null,null,null,null,null,null,null,null,null,null,null,null,null,null,0]
[4,null,null,null,{"$f":"IF(COUNTA(H39:AA39)=0,\"\",COUNTA(H39:AA39))","v":""},null,null,null,null,null,null,null,null,null,null,null,null,null,null,null,null,null,null,null,null,null,null,0,{"$f":"AB39-AB38","v":0}]
[null,null,null,null,null,null,null,null,null,null,null,null,null,null,null,null,null,null,null,null,null,null,null,null,null,null,null,0]
[4,null,null,null,{"$f":"IF(COUNTA(H41:AA41)=0,\"\",COUNTA(H41:AA41))","v":""},null,null,null,null,null,null,null,null,null,null,null,null,null,null,null,null,null,null,null,null,null,null,0,{"$f":"AB41-AB40","v":0}]
[null,null,null,null,null,null,null,46,null,null,null,null,null,null,null,null,null,null,null,null,null,null,null,null,null,null,null,1]
[4,null,null,null,{"$f":"IF(COUNTA(H43:AA43)=0,\"\",COUNTA(H43:AA43))","v":1},"LHR","榎本","*25",null,null,null,null,null,null,null,null,null,null,null,null,null,null,null,null,null,null,null,1,{"$f":"AB43-AB42","v":0}]
[null,null,null,null,null,null,null,15,21,43,51,42,62,52,22,null,null,null,null,null,null,null,null,null,null,null,null,8]
[5,null,{"$f":"IF(G2246=\"\",\"\",G2246)","v":"矢島"},4,{"$f":"IF(COUNTA(H45:AA45)=0,\"\",COUNTA(H45:AA45))","v":8},"国Ⅱ","矢島","*21","*21","*21","*21","*22","*22","*22","*22",null,null,null,null,null,null,null,null,null,null,null,null,8,{"$f":"AB45-AB44","v":0}]
[null,null,null,null,null,null,null,26,44,null,null,null,null,null,null,null,null,null,null,null,null,null,null,null,null,null,null,2]
[5,null,null,2,{"$f":"IF(COUNTA(H47:AA47)=0,\"\",COUNTA(H47:AA47))","v":2},"古典","矢島","*36","*36",null,null,null,null,null,null,null,null,null,null,null,null,null,null,null,null,null,null,2,{"$f":"AB47-AB46","v":0}]
[null,null,null,null,null,null,null,null,null,null,null,null,null,null,null,null,null,null,null,null,null,null,null,null,null,null,null,0]
[5,null,null,null,{"$f":"IF(COUNTA(H49:AA49)=0,\"\",COUNTA(H49:AA49))","v":""},null,null,null,null,null,null,null,null,null,null,null,null,null,null,null,null,null,null,null,null,null,null,0,{"$f":"AB49-AB48","v":0}]
[null,null,null,null,null,null,null,null,null,null,null,null,null,null,null,null,null,null,null,null,null,null,null,null,null,null,null,0]
[5,null,null,null,{"$f":"IF(COUNTA(H51:AA51)=0,\"\",COUNTA(H51:AA51))","v":""},null,null,null,null,null,null,null,null,null,null,null,null,null,null,null,null,null,null,null,null,null,null,0,{"$f":"AB51-AB50","v":0}]
[null,null,null,null,null,null,null,null,null,null,null,null,null,null,null,null,null,null,null,null,null,null,null,null,null,null,null,0]
[5,null,null,null,{"$f":"IF(COUNTA(H53:AA53)=0,\"\",COUNTA(H53:AA53))","v":""},null,null,null,null,null,null,null,null,null,null,null,null,null,null,null,null,null,null,null,null,null,null,0,{"$f":"AB53-AB52","v":0}]
[null,null,null,null,null,null,null,14,61,26,52,15,36,34,12,null,null,null,null,null,null,null,null,null,null,null,null,8]
[6,null,{"$f":"IF(G2248=\"\",\"\",G2248)","v":"関根"},3,{"$f":"IF(COUNTA(H55:AA55)=0,\"\",COUNTA(H55:AA55))","v":9},"現文","関根","*32","*32","*32","*35","*35","*35","*37","*37","*37",null,null,null,null,null,null,null,null,null,null,null,9,{"$f":"AB55-AB54","v":1}]
[null,null,null,null,null,null,null,16,45,33,51,null,null,null,null,null,null,null,null,null,null,null,null,null,null,null,null,4]
[6,null,null,4,{"$f":"IF(COUNTA(H57:AA57)=0,\"\",COUNTA(H57:AA57))","v":4},"古典","関根","*31","*31","*31","*31",null,null,null,null,null,null,null,null,null,null,null,null,null,null,null,null,4,{"$f":"AB57-AB56","v":0}]
[null,null,null,null,null,null,null,null,null,null,null,null,null,null,null,null,null,null,null,null,null,null,null,null,null,null,null,0]
[6,null,null,null,{"$f":"IF(COUNTA(H59:AA59)=0,\"\",COUNTA(H59:AA59))","v":""},null,null,null,null,null,null,null,null,null,null,null,null,null,null,null,null,null,null,null,null,null,null,0,{"$f":"AB59-AB58","v":0}]
[null,null,null,null,null,null,null,null,null,null,null,null,null,null,null,null,null,null,null,null,null,null,null,null,null,null,null,0]
[6,null,null,null,{"$f":"IF(COUNTA(H61:AA61)=0,\"\",COUNTA(H61:AA61))","v":""},null,null,null,null,null,null,null,null,null,null,null,null,null,null,null,null,null,null,null,null,null,null,0,{"$f":"AB61-AB60","v":0}]
[null,null,null,null,null,null,null,46,null,null,null,null,null,null,null,null,null,null,null,null,null,null,null,null,null,null,null,1]
[6,null,null,null,{"$f":"IF(COUNTA(H63:AA63)=0,\"\",COUNTA(H63:AA63))","v":1},"LHR","関根","*35",null,null,null,null,null,null,null,null,null,null,null,null,null,null,null,null,null,null,null,1,{"$f":"AB63-AB62","v":0}]
[null,null,null,null,null,null,null,55,35,15,25,null,null,null,null,null,null,null,null,null,null,null,null,null,null,null,null,4]
[7," ",{"$f":"IF(G2250=\"\",\"\",G2250)","v":"松本ﾔ"},4,{"$f":"IF(COUNTA(H65:AA65)=0,\"\",COUNTA(H65:AA65))","v":4},"国Ⅱ","松本ﾔ","*26","*26","*26","*26",null,null,null,null,null,null,null,null,null,null,null,null,null,null,null,null,4,{"$f":"AB65-AB64","v":0}]
[null,null,null,null,null,null,null,41,33,24,31,42,53,null,null,null,null,null,null,null,null,null,null,null,null,null,null,6]
[7," ",null,3,{"$f":"IF(COUNTA(H67:AA67)=0,\"\",COUNTA(H67:AA67))","v":6},"現文","松本ﾔ","*36","*36","*36","*38","*38","*38",null,null,null,null,null,null,null,null,null,null,null,null,null,null,6,{"$f":"AB67-AB66","v":0}]
[null,null,null,null,null,null,null,null,null,null,null,null,null,null,null,null,null,null,null,null,null,null,null,null,null,null,null,{"$f":"COUNTA(H68:AA68)","v":0}]
[7,null,null,null,{"$f":"IF(COUNTA(H69:AA69)=0,\"\",COUNTA(H69:AA69))","v":""},null,null,null,null,null,null,null,null,null,null,null,null,null,null,null,null,null,null,null,null,null,null,0,{"$f":"AB69-AB68","v":0}]
[null,null,null,null,null,null,null,null,null,null,null,null,null,null,null,null,null,null,null,null,null,null,null,null,null,null,null,0]
[7,null,null,null,{"$f":"IF(COUNTA(H71:AA71)=0,\"\",COUNTA(H71:AA71))","v":""},null,null,null,null,null,null,null,null,null,null,null,null,null,null,null,null,null,null,null,null,null,null,0,{"$f":"AB71-AB70","v":0}]
[null,null,null,null,null,null,null,null,null,null,null,null,null,null,null,null,null,null,null,null,null,null,null,null,null,null,null,0]
[7,null,null,null,{"$f":"IF(COUNTA(H73:AA73)=0,\"\",COUNTA(H73:AA73))","v":""},null,null,null,null,null,null,null,null,null,null,null,null,null,null,null,null,null,null,null,null,null,null,0,{"$f":"AB73-AB72","v":0}]
[null,null,null,null,null,null,null,null,null,null,null,null,null,null,null,null,null,null,null,null,null,null,null,null,null,null,null,0]
[8,null,{"$f":"IF(G2252=\"\",\"\",G2252)","v":"千田"},null,{"$f":"IF(COUNTA(H75:AA75)=0,\"\",COUNTA(H75:AA75))","v":""},null,null,null,null,null,null,null,null,null,null,null,null,null,null,null,null,null,null,null,null,null,null,0,{"$f":"AB75-AB74","v":0}]
[null,null,null,null,null,null,null,null,null,null,null,null,null,null,null,null,null,null,null,null,null,null,null,null,null,null,null,0]
[8,null,null,null,{"$f":"IF(COUNTA(H77:AA77)=0,\"\",COUNTA(H77:AA77))","v":""},null,null,null,null,null,null,null,null,null,null,null,null,null,null,null,null,null,null,null,null,null,null,0,{"$f":"AB77-AB76","v":0}]
[null,null,null,null,null,null,null,null,null,null,null,null,null,null,null,null,null,null,null,null,null,null,null,null,null,null,null,0]
[8,null,null,null,{"$f":"IF(COUNTA(H79:AA79)=0,\"\",COUNTA(H79:AA79))","v":""},null,null,null,null,null,null,null,null,null,null,null,null,null,null,null,null,null,null,null,null,null,null,0,{"$f":"AB79-AB78","v":0}]
[null,null,null,null,null,null,null,null,null,null,null,null,null,null,null,null,null,null,null,null,null,null,null,null,null,null,null,0]
[8," ",null,null,{"$f":"IF(COUNTA(H81:AA81)=0,\"\",COUNTA(H81:AA81))","v":""},null,null,null,null,null,null,null,null,null,null,null,null,null,null,null,null,null,null,null,null,null,null,0,{"$f":"AB81-AB80","v":0}]
[null,null,null,null,null,null,null,null,null,null,null,null,null,null,null,null,null,null,null,null,null,null,null,null,null,null,null,0]
[8," ",null,null,{"$f":"IF(COUNTA(H83:AA83)=0,\"\",COUNTA(H83:AA83))","v":""},null,null,null,null,null,null,null,null,null,null,null,null,null,null,null,null,null,null,null,null,null,null,0,{"$f":"AB83-AB82","v":0}]
[null,null,null,null,null,null,null,null,null,null,null,null,null,null,null,null,null,null,null,null,null,null,null,null,null,null,null,0]
[9,null,{"$f":"IF(G2254=\"\",\"\",G2254)","v":"山田"},null,{"$f":"IF(COUNTA(H85:AA85)=0,\"\",COUNTA(H85:AA85))","v":""},null,null,null,null,null,null,null,null,null,null,null,null,null,null,null,null,null,null,null,null,null,null,0,{"$f":"AB85-AB84","v":0}]
[null,null,null,null,null,null,null,null,null,null,null,null,null,null,null,null,null,null,null,null,null,null,null,null,null,null,null,0]
[9,null,null,null,{"$f":"IF(COUNTA(H87:AA87)=0,\"\",COUNTA(H87:AA87))","v":""},null,null,null,null,null,null,null,null,null,null,null,null,null,null,null,null,null,null,null,null,null,null,0,{"$f":"AB87-AB86","v":0}]
[null,null,null,null,null,null,null,null,null,null,null,null,null,null,null,null,null,null,null,null,null,null,null,null,null,null,null,0]
[9,null,null,null,{"$f":"IF(COUNTA(H89:AA89)=0,\"\",COUNTA(H89:AA89))","v":""},null,null,null,null,null,null,null,null,null,null,null,null,null,null,null,null,null,null,null,null,null,null,0,{"$f":"AB89-AB88","v":0}]
[null,null,null,null,null,null,null,null,null,null,null,null,null,null,null,null,null,null,null,null,null,null,null,null,null,null,null,0]
[9,null,null,null,{"$f":"IF(COUNTA(H91:AA91)=0,\"\",COUNTA(H91:AA91))","v":""},null,null,null,null,null,null,null,null,null,null,null,null,null,null,null,null,null,null,null,null,null,null,0,{"$f":"AB91-AB90","v":0}]
[null,null,null,null,null,null,null,null,null,null,null,null,null,null,null,null,null,null,null,null,null,null,null,null,null,null,null,0]
[9,null,null,null,{"$f":"IF(COUNTA(H93:AA93)=0,\"\",COUNTA(H93:AA93))","v":""},null,null,null,null,null,null,null,null,null,null,null,null,null,null,null,null,null,null,null,null,null,null,0,{"$f":"AB93-AB92","v":0}]
[null,null,null,null,null,null,null,null,null,null,null,null,null,null,null,null,null,null,null,null,null,null,null,null,null,null,null,0]
[10,null,{"$f":"IF(G2256=\"\",\"\",G2256)","v":"t10"},null,{"$f":"IF(COUNTA(H95:AA95)=0,\"\",COUNTA(H95:AA95))","v":""},null,null,null,null,null,null,null,null,null,null,null,null,null,null,null,null,null,null,null,null,null,null,0,{"$f":"AB95-AB94","v":0}]
[null,null,null,null,null,null,null,null,null,null,null,null,null,null,null,null,null,null,null,null,null,null,null,null,null,null,null,0]
[10,null,null,null,{"$f":"IF(COUNTA(H97:AA97)=0,\"\",COUNTA(H97:AA97))","v":""},null,null,null,null,null,null,null,null,null,null,null,null,null,null,null,null,null,null,null,null,null,null,0,{"$f":"AB97-AB96","v":0}]
[null,null,null,null,null,null,null,null,null,null,null,null,null,null,null,null,null,null,null,null,null,null,null,null,null,null,null,0]
[10,null,null,null,{"$f":"IF(COUNTA(H99:AA99)=0,\"\",COUNTA(H99:AA99))","v":""},null,null,null,null,null,null,null,null,null,null,null,null,null,null,null,null,null,null,null,null,null,null,0,{"$f":"AB99-AB98","v":0}]
[null,null,null,null,null,null,null,null,null,null,null,null,null,null,null,null,null,null,null,null,null,null,null,null,null,null,null,0]
[10,null,null,null,{"$f":"IF(COUNTA(H101:AA101)=0,\"\",COUNTA(H101:AA101))","v":""},null,null,null,null,null,null,null,null,null,null,null,null,null,null,null,null,null,null,null,null,null,null,0,{"$f":"AB101-AB100","v":0}]
[null,null,null,null,null,null,null,null,null,null,null,null,null,null,null,null,null,null,null,null,null,null,null,null,null,null,null,0]
[10,null,null,null,{"$f":"IF(COUNTA(H103:AA103)=0,\"\",COUNTA(H103:AA103))","v":""},null,null,null,null,null,null,null,null,null,null,null,null,null,null,null,null,null,null,null,null,null,null,0,{"$f":"AB103-AB102","v":0}]
[null,null,null,null,null,null,null,null,null,null,null,null,null,null,null,null,null,null,null,null,null,null,null,null,null,null,null,0]
[11,null,{"$f":"IF(G2258=\"\",\"\",G2258)","v":"t11"},null,{"$f":"IF(COUNTA(H105:AA105)=0,\"\",COUNTA(H105:AA105))","v":""},null,null,null,null,null,null,null,null,null,null,null,null,null,null,null,null,null,null,null,null,null,null,0,{"$f":"AB105-AB104","v":0}]
[null,null,null,null,null,null,null,null,null,null,null,null,null,null,null,null,null,null,null,null,null,null,null,null,null,null,null,0]
[11," ",null,null,{"$f":"IF(COUNTA(H107:AA107)=0,\"\",COUNTA(H107:AA107))","v":""},null,null,null,null,null,null,null,null,null,null,null,null,null,null,null,null,null,null,null,null,null,null,0,{"$f":"AB107-AB106","v":0}]
[null,null,null,null,null,null,null,null,null,null,null,null,null,null,null,null,null,null,null,null,null,null,null,null,null,null,null,0]
[11,null,null,null,{"$f":"IF(COUNTA(H109:AA109)=0,\"\",COUNTA(H109:AA109))","v":""},null,null,null,null,null,null,null,null,null,null,null,null,null,null,null,null,null,null,null,null,null,null,0,{"$f":"AB109-AB108","v":0}]
[null,null,null,null,null,null,null,null,null,null,null,null,null,null,null,null,null,null,null,null,null,null,null,null,null,null,null,0]
[11,null,null,null,{"$f":"IF(COUNTA(H111:AA111)=0,\"\",COUNTA(H111:AA111))","v":""},null,null,null,null,null,null,null,null,null,null,null,null,null,null,null,null,null,null,null,null,null,null,0,{"$f":"AB111-AB110","v":0}]
[null,null,null,null,null,null,null,null,null,null,null,null,null,null,null,null,null,null,null,null,null,null,null,null,null,null,null,0]
[11,null,null,null,{"$f":"IF(COUNTA(H113:AA113)=0,\"\",COUNTA(H113:AA113))","v":""},null,null,null,null,null,null,null,null,null,null,null,null,null,null,null,null,null,null,null,null,null,null,0,{"$f":"AB113-AB112","v":0}]
[null,null,null,null,null,null,null,null,null,null,null,null,null,null,null,null,null,null,null,null,null,null,null,null,null,null,null,0]
[12,null,{"$f":"IF(G2260=\"\",\"\",G2260)","v":"t12"},null,{"$f":"IF(COUNTA(H115:AA115)=0,\"\",COUNTA(H115:AA115))","v":""},null,null,null,null,null,null,null,null,null,null,null,null,null,null,null,null,null,null,null,null,null,null,0,{"$f":"AB115-AB114","v":0}]
[null,null,null,null,null,null,null,null,null,null,null,null,null,null,null,null,null,null,null,null,null,null,null,null,null,null,null,0]
[12,null,null,null,{"$f":"IF(COUNTA(H117:AA117)=0,\"\",COUNTA(H117:AA117))","v":""},null,null,null,null,null,null,null,null,null,null,null,null,null,null,null,null,null,null,null,null,null,null,0,{"$f":"AB117-AB116","v":0}]
[null,null,null,null,null,null,null,null,null,null,null,null,null,null,null,null,null,null,null,null,null,null,null,null,null,null,null,0]
[12,null,null,null,{"$f":"IF(COUNTA(H119:AA119)=0,\"\",COUNTA(H119:AA119))","v":""},null,null,null,null,null,null,null,null,null,null,null,null,null,null,null,null,null,null,null,null,null,null,0,{"$f":"AB119-AB118","v":0}]
[null,null,null,null,null,null,null,null,null,null,null,null,null,null,null,null,null,null,null,null,null,null,null,null,null,null,null,0]
[12,null,null,null,{"$f":"IF(COUNTA(H121:AA121)=0,\"\",COUNTA(H121:AA121))","v":""},null,null,null,null,null,null,null,null,null,null,null,null,null,null,null,null,null,null,null,null,null,null,0,{"$f":"AB121-AB120","v":0}]
[null,null,null,null,null,null,null,null,null,null,null,null,null,null,null,null,null,null,null,null,null,null,null,null,null,null,null,0]
[12,null,null,null,{"$f":"IF(COUNTA(H123:AA123)=0,\"\",COUNTA(H123:AA123))","v":""},null,null,null,null,null,null,null,null,null,null,null,null,null,null,null,null,null,null,null,null,null,null,0,{"$f":"AB123-AB122","v":0}]
[null,null,null,null,null,null,null,null,null,null,null,null,null,null,null,null,null,null,null,null,null,null,null,null,null,null,null,0]
[13,null,{"$f":"IF(G2262=\"\",\"\",G2262)","v":"t13"},null,{"$f":"IF(COUNTA(H125:AA125)=0,\"\",COUNTA(H125:AA125))","v":""},null,null,null,null,null,null,null,null,null,null,null,null,null,null,null,null,null,null,null,null,null,null,0,{"$f":"AB125-AB124","v":0}]
[null,null,null,null,null,null,null,null,null,null,null,null,null,null,null,null,null,null,null,null,null,null,null,null,null,null,null,0]
[13,null,null,null,{"$f":"IF(COUNTA(H127:AA127)=0,\"\",COUNTA(H127:AA127))","v":""},null,null,null,null,null,null,null,null,null,null,null,null,null,null,null,null,null,null,null,null,null,null,0,{"$f":"AB127-AB126","v":0}]
[null,null,null,null,null,null,null,null,null,null,null,null,null,null,null,null,null,null,null,null,null,null,null,null,null,null,null,0]
[13,null,null,null,{"$f":"IF(COUNTA(H129:AA129)=0,\"\",COUNTA(H129:AA129))","v":""},null,null,null,null,null,null,null,null,null,null,null,null,null,null,null,null,null,null,null,null,null,null,0,{"$f":"AB129-AB128","v":0}]
[null,null,null,null,null,null,null,null,null,null,null,null,null,null,null,null,null,null,null,null,null,null,null,null,null,null,null,0]
[13,null,null,null,{"$f":"IF(COUNTA(H131:AA131)=0,\"\",COUNTA(H131:AA131))","v":""},null,null,null,null,null,null,null,null,null,null,null,null,null,null,null,null,null,null,null,null,null,null,0,{"$f":"AB131-AB130","v":0}]
[null,null,null,null,null,null,null,null,null,null,null,null,null,null,null,null,null,null,null,null,null,null,null,null,null,null,null,{"$f":"COUNTA(H132:AA132)","v":0}]
[13,"語",null,null,{"$f":"IF(COUNTA(H133:AA133)=0,\"\",COUNTA(H133:AA133))","v":""},null,null,null,null,null,null,null,null,null,null,null,null,null,null,null,null,null,null,null,null,null,null,0,{"$f":"AB133-AB132","v":0}]
[null,null,null,null,null,null,null,null,null,null,null,null,null,null,null,null,null,null,null,null,null,null,null,null,null,null,null,0]
[14,null,{"$f":"IF(G2264=\"\",\"\",G2264)","v":"t14"},null,{"$f":"IF(COUNTA(H135:AA135)=0,\"\",COUNTA(H135:AA135))","v":""},null,null,null,null,null,null,null,null,null,null,null,null,null,null,null,null,null,null,null,null,null,null,0,{"$f":"AB135-AB134","v":0}]
[null,null,null,null,null,null,null,null,null,null,null,null,null,null,null,null,null,null,null,null,null,null,null,null,null,null,null,0]
[14,null,null,null,{"$f":"IF(COUNTA(H137:AA137)=0,\"\",COUNTA(H137:AA137))","v":""},null,null,null,null,null,null,null,null,null,null,null,null,null,null,null,null,null,null,null,null,null,null,0,{"$f":"AB137-AB136","v":0}]
[null,null,null,null,null,null,null,null,null,null,null,null,null,null,null,null,null,null,null,null,null,null,null,null,null,null,null,0]
[14,null,null,null,{"$f":"IF(COUNTA(H139:AA139)=0,\"\",COUNTA(H139:AA139))","v":""},null,null,null,null,null,null,null,null,null,null,null,null,null,null,null,null,null,null,null,null,null,null,0,{"$f":"AB139-AB138","v":0}]
[null,null,null,null,null,null,null,null,null,null,null,null,null,null,null,null,null,null,null,null,null,null,null,null,null,null,null,0]
[14,null,null,null,{"$f":"IF(COUNTA(H141:AA141)=0,\"\",COUNTA(H141:AA141))","v":""},null,null,null,null,null,null,null,null,null,null,null,null,null,null,null,null,null,null,null,null,null,null,0,{"$f":"AB141-AB140","v":0}]
[null,null,null,null,null,null,null,null,null,null,null,null,null,null,null,null,null,null,null,null,null,null,null,null,null,null,null,0]
[14,null,null,null,{"$f":"IF(COUNTA(H143:AA143)=0,\"\",COUNTA(H143:AA143))","v":""},null,null,null,null,null,null,null,null,null,null,null,null,null,null,null,null,null,null,null,null,null,null,0,{"$f":"AB143-AB142","v":0}]
[null,null,null,null,null,null,null,null,null,null,null,null,null,null,null,null,null,null,null,null,null,null,null,null,null,null,null,0]
[15,null,{"$f":"G2266","v":"t15"},null,null,null,null,null,null,null,null,null,null,null,null,null,null,null,null,null,null,null,null,null,null,null,null,0,{"$f":"AB145-AB144","v":0}]
[null,null,null,null,null,null,null,null,null,null,null,null,null,null,null,null,null,null,null,null,null,null,null,null,null,null,null,0]
[15,null,null,null,null,null,null,null,null,null,null,null,null,null,null,null,null,null,null,null,null,null,null,null,null,null,null,0,{"$f":"AB147-AB146","v":0}]
[null,null,null,null,null,null,null,null,null,null,null,null,null,null,null,null,null,null,null,null,null,null,null,null,null,null,null,0]
[15,null,null,null,null,null,null,null,null,null,null,null,null,null,null,null,null,null,null,null,null,null,null,null,null,null,null,0,{"$f":"AB149-AB148","v":0}]
[null,null,null,null,null,null,null,null,null,null,null,null,null,null,null,null,null,null,null,null,null,null,null,null,null,null,null,0]
[15,null,null,null,null,null,null,null,null,null,null,null,null,null,null,null,null,null,null,null,null,null,null,null,null,null,null,0,{"$f":"AB151-AB150","v":0}]
[null,null,null,null,null,null,null,null,null,null,null,null,null,null,null,null,null,null,null,null,null,null,null,null,null,null,null,0]
[15,null,null,null,null,null,null,null,null,null,null,null,null,null,null,null,null,null,null,null,null,null,null,null,null,null,null,0,{"$f":"AB153-AB152","v":0}]
[null,null,null,null,null,null,null,null,null,null,null,null,null,null,null,null,null,null,null,null,null,null,null,null,null,null,null,0]
[16,null,{"$f":"G2268","v":"t16"},null,null,null,null,null,null,null,null,null,null,null,null,null,null,null,null,null,null,null,null,null,null,null,null,0,{"$f":"AB155-AB154","v":0}]
[null,null,null,null,null,null,null,null,null,null,null,null,null,null,null,null,null,null,null,null,null,null,null,null,null,null,null,0]
[16,null,null,null,null,null,null,null,null,null,null,null,null,null,null,null,null,null,null,null,null,null,null,null,null,null,null,0,{"$f":"AB157-AB156","v":0}]
[null,null,null,null,null,null,null,null,null,null,null,null,null,null,null,null,null,null,null,null,null,null,null,null,null,null,null,0]
[16,null,null,null,null,null,null,null,null,null,null,null,null,null,null,null,null,null,null,null,null,null,null,null,null,null,null,0,{"$f":"AB159-AB158","v":0}]
[null,null,null,null,null,null,null,null,null,null,null,null,null,null,null,null,null,null,null,null,null,null,null,null,null,null,null,0]
[16,null,null,null,null,null,null,null,null,null,null,null,null,null,null,null,null,null,null,null,null,null,null,null,null,null,null,0,{"$f":"AB161-AB160","v":0}]
[null,null,null,null,null,null,null,null,null,null,null,null,null,null,null,null,null,null,null,null,null,null,null,null,null,null,null,0]
[16,null,null,null,null,null,null,null,null,null,null,null,null,null,null,null,null,null,null,null,null,null,null,null,null,null,null,0,{"$f":"AB163-AB162","v":0}]
[null,null,null,null,null,null,null,null,null,null,null,null,null,null,null,null,null,null,null,null,null,null,null,null,null,null,null,0]
[17,null,{"$f":"G2270","v":"t17"},null,null,null,null,null,null,null,null,null,null,null,null,null,null,null,null,null,null,null,null,null,null,null,null,0,{"$f":"AB165-AB164","v":0}]
[null,null,null,null,null,null,null,null,null,null,null,null,null,null,null,null,null,null,null,null,null,null,null,null,null,null,null,0]
[17,null,null,null,null,null,null,null,null,null,null,null,null,null,null,null,null,null,null,null,null,null,null,null,null,null,null,0,{"$f":"AB167-AB166","v":0}]
[null,null,null,null,null,null,null,null,null,null,null,null,null,null,null,null,null,null,null,null,null,null,null,null,null,null,null,0]
[17,null,null,null,null,null,null,null,null,null,null,null,null,null,null,null,null,null,null,null,null,null,null,null,null,null,null,0,{"$f":"AB169-AB168","v":0}]
[null,null,null,null,null,null,null,null,null,null,null,null,null,null,null,null,null,null,null,null,null,null,null,null,null,null,null,0]
[17,null,null,null,null,null,null,null,null,null,null,null,null,null,null,null,null,null,null,null,null,null,null,null,null,null,null,0,{"$f":"AB171-AB170","v":0}]
[null,null,null,null,null,null,null,null,null,null,null,null,null,null,null,null,null,null,null,null,null,null,null,null,null,null,null,0]
[17,null,null,null,null,null,null,null,null,null,null,null,null,null,null,null,null,null,null,null,null,null,null,null,null,null,null,0,{"$f":"AB173-AB172","v":0}]
[null,null,null,null,null,null,null,null,null,null,null,null,null,null,null,null,null,null,null,null,null,null,null,null,null,null,null,0]
[18,null,{"$f":"G2272","v":"t18"},null,null,null,null,null,null,null,null,null,null,null,null,null,null,null,null,null,null,null,null,null,null,null,null,0,{"$f":"AB175-AB174","v":0}]
[null,null,null,null,null,null,null,null,null,null,null,null,null,null,null,null,null,null,null,null,null,null,null,null,null,null,null,0]
[18,null,null,null,null,null,null,null,null,null,null,null,null,null,null,null,null,null,null,null,null,null,null,null,null,null,null,0,{"$f":"AB177-AB176","v":0}]
[null,null,null,null,null,null,null,null,null,null,null,null,null,null,null,null,null,null,null,null,null,null,null,null,null,null,null,0]
[18,null,null,null,null,null,null,null,null,null,null,null,null,null,null,null,null,null,null,null,null,null,null,null,null,null,null,0,{"$f":"AB179-AB178","v":0}]
[null,null,null,null,null,null,null,null,null,null,null,null,null,null,null,null,null,null,null,null,null,null,null,null,null,null,null,0]
[18,null,null,null,null,null,null,null,null,null,null,null,null,null,null,null,null,null,null,null,null,null,null,null,null,null,null,0,{"$f":"AB181-AB180","v":0}]
[null,null,null,null,null,null,null,null,null,null,null,null,null,null,null,null,null,null,null,null,null,null,null,null,null,null,null,0]
[18,null,null,null,null,null,null,null,null,null,null,null,null,null,null,null,null,null,null,null,null,null,null,null,null,null,null,0,{"$f":"AB183-AB182","v":0}]
[null,null,null,null,null,null,null,null,null,null,null,null,null,null,null,null,null,null,null,null,null,null,null,null,null,null,null,0]
[19,null,{"$f":"G2274","v":"t19"},null,null,null,null,null,null,null,null,null,null,null,null,null,null,null,null,null,null,null,null,null,null,null,null,0,{"$f":"AB185-AB184","v":0}]
[null,null,null,null,null,null,null,null,null,null,null,null,null,null,null,null,null,null,null,null,null,null,null,null,null,null,null,0]
[19,null,null,null,null,null,null,null,null,null,null,null,null,null,null,null,null,null,null,null,null,null,null,null,null,null,null,0,{"$f":"AB187-AB186","v":0}]
[null,null,null,null,null,null,null,null,null,null,null,null,null,null,null,null,null,null,null,null,null,null,null,null,null,null,null,0]
[19,null,null,null,null,null,null,null,null,null,null,null,null,null,null,null,null,null,null,null,null,null,null,null,null,null,null,0,{"$f":"AB189-AB188","v":0}]
[null,null,null,null,null,null,null,null,null,null,null,null,null,null,null,null,null,null,null,null,null,null,null,null,null,null,null,0]
[19,null,null,null,null,null,null,null,null,null,null,null,null,null,null,null,null,null,null,null,null,null,null,null,null,null,null,0,{"$f":"AB191-AB190","v":0}]
[null,null,null,null,null,null,null,null,null,null,null,null,null,null,null,null,null,null,null,null,null,null,null,null,null,null,null,0]
[19,null,null,null,null,null,null,null,null,null,null,null,null,null,null,null,null,null,null,null,null,null,null,null,null,null,null,0,{"$f":"AB193-AB192","v":0}]
[null,null,null,null,null,null,null,null,null,null,null,null,null,null,null,null,null,null,null,null,null,null,null,null,null,null,null,0]
[20,null,{"$f":"IF(G2276=\"\",\"\",G2276)","v":"t20"},null,{"$f":"IF(COUNTA(H195:AA195)=0,\"\",COUNTA(H195:AA195))","v":""},null,null,null,null,null,null,null,null,null,null,null,null,null,null,null,null,null,null,null,null,null,null,0,{"$f":"AB195-AB194","v":0}]
[null,null,null,null,null,null,null,null,null,null,null,null,null,null,null,null,null,null,null,null,null,null,null,null,null,null,null,{"$f":"COUNTA(H196:AA196)","v":0}]
[20," ",null,null,{"$f":"IF(COUNTA(H197:AA197)=0,\"\",COUNTA(H197:AA197))","v":""},null,null,null,null,null,null,null,null,null,null,null,null,null,null,null,null,null,null,null,null,null,null,0,{"$f":"AB197-AB196","v":0}]
[null,null,null,null,null,null,null,null,null,null,null,null,null,null,null,null,null,null,null,null,null,null,null,null,null,null,null,0]
[20,null,null,null,{"$f":"IF(COUNTA(H199:AA199)=0,\"\",COUNTA(H199:AA199))","v":""},null,null,null,null,null,null,null,null,null,null,null,null,null,null,null,null,null,null,null,null,null,null,0,{"$f":"AB199-AB198","v":0}]
[null,null,null,null,null,null,null,null,null,null,null,null,null,null,null,null,null,null,null,null,null,null,null,null,null,null,null,0]
[20,null,null,null,{"$f":"IF(COUNTA(H201:AA201)=0,\"\",COUNTA(H201:AA201))","v":""},null,null,null,null,null,null,null,null,null,null,null,null,null,null,null,null,null,null,null,null,null,null,0,{"$f":"AB201-AB200","v":0}]
[null,null,null,null,null,null,null,null,null,null,null,null,null,null,null,null,null,null,null,null,null,null,null,null,null,null,null,0]
[20," ",null,null,{"$f":"IF(COUNTA(H203:AA203)=0,\"\",COUNTA(H203:AA203))","v":""},null,null,null,null,null,null,null,null,null,null,null,null,null,null,null,null,null,null,null,null,null,null,0,{"$f":"AB203-AB202","v":0}]
[null,null,null,null,null,null,null,55,42,51,16,null,null,null,null,null,null,null,null,null,null,null,null,null,null,null,null,4]
[21," ",{"$f":"IF(G2278=\"\",\"\",G2278)","v":"新井"},2,{"$f":"IF(COUNTA(H205:AA205)=0,\"\",COUNTA(H205:AA205))","v":4},"地理","新井","*11","*11","*12","*12",null,null,null,null,null,null,null,null,null,null,null,null,null,null,null,null,4,{"$f":"AB205-AB204","v":0}]
[null,null,null,null,null,null,null,15,61,43,24,45,52,23,36,11,33,22,53,null,null,null,null,null,null,null,null,12]
[21," ",null,4,{"$f":"IF(COUNTA(H207:AA207)=0,\"\",COUNTA(H207:AA207))","v":12},"日史","新井","*31","*31","*31","*31","*32","*32","*32","*32","*33","*33","*33","*33",null,null,null,null,null,null,null,null,12,{"$f":"AB207-AB206","v":0}]
[null,null,null,null,null,null,null,null,null,null,null,null,null,null,null,null,null,null,null,null,null,null,null,null,null,null,null,0]
[21,null,null,null,{"$f":"IF(COUNTA(H209:AA209)=0,\"\",COUNTA(H209:AA209))","v":""},null,null,null,null,null,null,null,null,null,null,null,null,null,null,null,null,null,null,null,null,null,null,0,{"$f":"AB209-AB208","v":0}]
[null,null,null,null,null,null,null,null,null,null,null,null,null,null,null,null,null,null,null,null,null,null,null,null,null,null,null,0]
[21,null,null,null,{"$f":"IF(COUNTA(H211:AA211)=0,\"\",COUNTA(H211:AA211))","v":""},null,null,null,null,null,null,null,null,null,null,null,null,null,null,null,null,null,null,null,null,null,null,0,{"$f":"AB211-AB210","v":0}]
[null,null,null,null,null,null,null,46,null,null,null,null,null,null,null,null,null,null,null,null,null,null,null,null,null,null,null,1]
[21,null,null,null,{"$f":"IF(COUNTA(H213:AA213)=0,\"\",COUNTA(H213:AA213))","v":1},"LHR","新井","*12",null,null,null,null,null,null,null,null,null,null,null,null,null,null,null,null,null,null,null,1,{"$f":"AB213-AB212","v":0}]
[null,null,null,null,null,null,null,44,61,34,null,62,45,36,13,null,null,null,null,null,null,null,null,null,null,null,null,7]
[22,"地",{"$f":"IF(G2280=\"\",\"\",G2280)","v":"福田"},2,{"$f":"IF(COUNTA(H215:AA215)=0,\"\",COUNTA(H215:AA215))","v":8},"地理","福田","*13","*13","*15","*15","*16","*16","*18","*18",null,null,null,null,null,null,null,null,null,null,null,null,8,{"$f":"AB215-AB214","v":1}]
[null,null,null,null,null,null,null,35,23,42,11,15,51,43,33,null,null,null,null,null,null,null,null,null,null,null,null,8]
[22," ",null,4,{"$f":"IF(COUNTA(H217:AA217)=0,\"\",COUNTA(H217:AA217))","v":8},"世史","福田","*21","*21","*21","*21","*22","*22","*22","*22",null,null,null,null,null,null,null,null,null,null,null,null,8,{"$f":"AB217-AB216","v":0}]
[null,null,null,null,null,null,null,null,null,null,null,null,null,null,null,null,null,null,null,null,null,null,null,null,null,null,null,0]
[22,null,null,null,{"$f":"IF(COUNTA(H219:AA219)=0,\"\",COUNTA(H219:AA219))","v":""},null,null,null,null,null,null,null,null,null,null,null,null,null,null,null,null,null,null,null,null,null,null,0,{"$f":"AB219-AB218","v":0}]
[null,null,null,null,null,null,null,null,null,null,null,null,null,null,null,null,null,null,null,null,null,null,null,null,null,null,null,0]
[22,null,null,null,{"$f":"IF(COUNTA(H221:AA221)=0,\"\",COUNTA(H221:AA221))","v":""},null,null,null,null,null,null,null,null,null,null,null,null,null,null,null,null,null,null,null,null,null,null,0,{"$f":"AB221-AB220","v":0}]
[null,null,null,null,null,null,null,46,null,null,null,null,null,null,null,null,null,null,null,null,null,null,null,null,null,null,null,1]
[22," ",null,null,{"$f":"IF(COUNTA(H223:AA223)=0,\"\",COUNTA(H223:AA223))","v":1},"LHR","福田","*15",null,null,null,null,null,null,null,null,null,null,null,null,null,null,null,null,null,null,null,1,{"$f":"AB223-AB222","v":0}]
[null,null,null,null,null,null,null,31,13,36,24,null,null,null,null,null,null,null,null,null,null,null,null,null,null,null,null,4]
[23,null,{"$f":"IF(G2282=\"\",\"\",G2282)","v":"鶴巻"},2,{"$f":"IF(COUNTA(H225:AA225)=0,\"\",COUNTA(H225:AA225))","v":4},"地理","鶴巻","*14","*14","*17","*17",null,null,null,null,null,null,null,null,null,null,null,null,null,null,null,null,4,{"$f":"AB225-AB224","v":0}]
[null,null,null,null,null,null,null,45,62,35,11,32,54,26,52,16,61,21,51,null,null,null,null,null,null,null,null,12]
[23," ",null,2,{"$f":"IF(COUNTA(H227:AA227)=0,\"\",COUNTA(H227:AA227))","v":12},"倫理","鶴巻","*21","*21","*22","*22","*25","*25","*26","*26","*27","*27","*28","*28",null,null,null,null,null,null,null,null,12,{"$f":"AB227-AB226","v":0}]
[null,null,null,null,null,null,null,null,null,null,null,null,null,null,null,null,null,null,null,null,null,null,null,null,null,null,null,0]
[23,null,null,null,{"$f":"IF(COUNTA(H229:AA229)=0,\"\",COUNTA(H229:AA229))","v":""},null,null,null,null,null,null,null,null,null,null,null,null,null,null,null,null,null,null,null,null,null,null,0,{"$f":"AB229-AB228","v":0}]
[null,null,null,null,null,null,null,null,null,null,null,null,null,null,null,null,null,null,null,null,null,null,null,null,null,null,null,0]
[23," ",null,null,{"$f":"IF(COUNTA(H231:AA231)=0,\"\",COUNTA(H231:AA231))","v":""},null,null,null,null,null,null,null,null,null,null,null,null,null,null,null,null,null,null,null,null,null,null,0,{"$f":"AB231-AB230","v":0}]
[null,null,null,null,null,null,null,null,null,null,null,null,null,null,null,null,null,null,null,null,null,null,null,null,null,null,null,0]
[23,null,null,null,{"$f":"IF(COUNTA(H233:AA233)=0,\"\",COUNTA(H233:AA233))","v":""},null,null,null,null,null,null,null,null,null,null,null,null,null,null,null,null,null,null,null,null,null,null,0,{"$f":"AB233-AB232","v":0}]
[null,null,null,null,null,null,null,31,45,62,51,52,13,21,43,null,null,null,null,null,null,null,null,null,null,null,null,8]
[24,null,{"$f":"IF(G2284=\"\",\"\",G2284)","v":"小栗"},4,{"$f":"IF(COUNTA(H235:AA235)=0,\"\",COUNTA(H235:AA235))","v":8},"日史","小栗","*35","*35","*35","*35","*36","*36","*36","*36",null,null,null,null,null,null,null,null,null,null,null,null,8,{"$f":"AB235-AB234","v":0}]
[null,null,null,null,null,null,null,44,22,34,61,null,null,null,null,null,null,null,null,null,null,null,null,null,null,null,null,4]
[24,null,null,2,{"$f":"IF(COUNTA(H237:AA237)=0,\"\",COUNTA(H237:AA237))","v":4},"倫理","小栗","*23","*23","*24","*24",null,null,null,null,null,null,null,null,null,null,null,null,null,null,null,null,4,{"$f":"AB237-AB236","v":0}]
[null,null,null,null,null,null,null,12,41,null,null,null,null,null,null,null,null,null,null,null,null,null,null,null,null,null,null,2]
[24,null,null,2,{"$f":"IF(COUNTA(H239:AA239)=0,\"\",COUNTA(H239:AA239))","v":2},"選日","小栗","*32","*32",null,null,null,null,null,null,null,null,null,null,null,null,null,null,null,null,null,null,2,{"$f":"AB239-AB238","v":0}]
[null,null,null,null,null,null,null,null,null,null,null,null,null,null,null,null,null,null,null,null,null,null,null,null,null,null,null,0]
[24,null,null,null,{"$f":"IF(COUNTA(H241:AA241)=0,\"\",COUNTA(H241:AA241))","v":""},null,null,null,null,null,null,null,null,null,null,null,null,null,null,null,null,null,null,null,null,null,null,0,{"$f":"AB241-AB240","v":0}]
[null,null,null,null,null,null,null,46,null,null,null,null,null,null,null,null,null,null,null,null,null,null,null,null,null,null,null,1]
[24,null,null,null,{"$f":"IF(COUNTA(H243:AA243)=0,\"\",COUNTA(H243:AA243))","v":1},"LHR","小栗","*24",null,null,null,null,null,null,null,null,null,null,null,null,null,null,null,null,null,null,null,1,{"$f":"AB243-AB242","v":0}]
[null,null,null,null,null,null,null,22,14,42,34,44,62,35,23,43,53,61,11,null,null,null,null,null,null,null,null,12]
[25," ",{"$f":"IF(G2286=\"\",\"\",G2286)","v":"程田"},4,{"$f":"IF(COUNTA(H245:AA245)=0,\"\",COUNTA(H245:AA245))","v":12},"世史","程田","*26","*26","*26","*26","*27","*27","*27","*27","*28","*28","*28","*28",null,null,null,null,null,null,null,null,12,{"$f":"AB245-AB244","v":0}]
[null,null,null,null,null,null,null,32,54,16,24,null,null,null,null,null,null,null,null,null,null,null,null,null,null,null,null,4]
[25,null,null,2,{"$f":"IF(COUNTA(H247:AA247)=0,\"\",COUNTA(H247:AA247))","v":4},"政経","程田","*31","*31","*32","*32",null,null,null,null,null,null,null,null,null,null,null,null,null,null,null,null,4,{"$f":"AB247-AB246","v":0}]
[null,null,null,null,null,null,null,null,null,null,null,null,null,null,null,null,null,null,null,null,null,null,null,null,null,null,null,0]
[25,null,null,null,{"$f":"IF(COUNTA(H249:AA249)=0,\"\",COUNTA(H249:AA249))","v":""},null,null,null,null,null,null,null,null,null,null,null,null,null,null,null,null,null,null,null,null,null,null,0,{"$f":"AB249-AB248","v":0}]
[null,null,null,null,null,null,null,null,null,null,null,null,null,null,null,null,null,null,null,null,null,null,null,null,null,null,null,0]
[25," ",null,null,{"$f":"IF(COUNTA(H251:AA251)=0,\"\",COUNTA(H251:AA251))","v":""},null,null,null,null,null,null,null,null,null,null,null,null,null,null,null,null,null,null,null,null,null,null,0,{"$f":"AB251-AB250","v":0}]
[null,null,null,null,null,null,null,null,null,null,null,null,null,null,null,null,null,null,null,null,null,null,null,null,null,null,null,0]
[25,"歴",null,null,{"$f":"IF(COUNTA(H253:AA253)=0,\"\",COUNTA(H253:AA253))","v":""},null,null,null,null,null,null,null,null,null,null,null,null,null,null,null,null,null,null,null,null,null,null,0,{"$f":"AB253-AB252","v":0}]
[null,null,null,null,null,null,null,24,51,62,13,43,22,15,61,45,14,52,23,null,null,null,null,null,null,null,null,12]
[26," ",{"$f":"IF(G2288=\"\",\"\",G2288)","v":"長澤"},4,{"$f":"IF(COUNTA(H255:AA255)=0,\"\",COUNTA(H255:AA255))","v":12},"日史","長澤","*34","*34","*34","*34","*37","*37","*37","*37","*38","*38","*38","*38",null,null,null,null,null,null,null,null,12,{"$f":"AB255-AB254","v":0}]
[null,null,null,null,null,null,null,null,null,null,null,null,null,null,null,null,null,null,null,null,null,null,null,null,null,null,null,0]
[26,null,null,null,{"$f":"IF(COUNTA(H257:AA257)=0,\"\",COUNTA(H257:AA257))","v":""},null,null,null,null,null,null,null,null,null,null,null,null,null,null,null,null,null,null,null,null,null,null,0,{"$f":"AB257-AB256","v":0}]
[null,null,null,null,null,null,null,null,null,null,null,null,null,null,null,null,null,null,null,null,null,null,null,null,null,null,null,0]
[26,null,null,null,{"$f":"IF(COUNTA(H259:AA259)=0,\"\",COUNTA(H259:AA259))","v":""},null,null,null,null,null,null,null,null,null,null,null,null,null,null,null,null,null,null,null,null,null,null,0,{"$f":"AB259-AB258","v":0}]
[null,null,null,null,null,null,null,null,null,null,null,null,null,null,null,null,null,null,null,null,null,null,null,null,null,null,null,{"$f":"COUNTA(H260:AA260)","v":0}]
[26,null,null,null,{"$f":"IF(COUNTA(H261:AA261)=0,\"\",COUNTA(H261:AA261))","v":""},null,null,null,null,null,null,null,null,null,null,null,null,null,null,null,null,null,null,null,null,null,null,0,{"$f":"AB261-AB260","v":0}]
[null,null,null,null,null,null,null,null,null,null,null,null,null,null,null,null,null,null,null,null,null,null,null,null,null,null,null,0]
[26," ",null,null,{"$f":"IF(COUNTA(H263:AA263)=0,\"\",COUNTA(H263:AA263))","v":""},null,null,null,null,null,null,null,null,null,null,null,null,null,null,null,null,null,null,null,null,null,null,0,{"$f":"AB263-AB262","v":0}]
[null,null,null,null,null,null,null,31,22,null,null,null,null,null,null,null,null,null,null,null,null,null,null,null,null,null,null,2]
[27,null,{"$f":"IF(G2290=\"\",\"\",G2290)","v":"松本ﾀ"},2,{"$f":"IF(COUNTA(H265:AA265)=0,\"\",COUNTA(H265:AA265))","v":2},"選日","松本ﾀ","*31","*31",null,null,null,null,null,null,null,null,null,null,null,null,null,null,null,null,null,null,2,{"$f":"AB265-AB264","v":0}]
[null,null,null,null,null,null,null,43,62,54,61,24,16,23,45,11,21,34,41,null,null,null,null,null,null,null,null,12]
[27,null,null,2,{"$f":"IF(COUNTA(H267:AA267)=0,\"\",COUNTA(H267:AA267))","v":12},"政経","松本ﾀ","*33","*33","*34","*34","*35","*35","*36","*36","*37","*37","*38","*38",null,null,null,null,null,null,null,null,12,{"$f":"AB267-AB266","v":0}]
[null,null,null,null,null,null,null,null,null,null,null,null,null,null,null,null,null,null,null,null,null,null,null,null,null,null,null,0]
[27,null,null,null,{"$f":"IF(COUNTA(H269:AA269)=0,\"\",COUNTA(H269:AA269))","v":""},null,null,null,null,null,null,null,null,null,null,null,null,null,null,null,null,null,null,null,null,null,null,0,{"$f":"AB269-AB268","v":0}]
[null,null,null,null,null,null,null,null,null,null,null,null,null,null,null,null,null,null,null,null,null,null,null,null,null,null,null,0]
[27,null,null,null,{"$f":"IF(COUNTA(H271:AA271)=0,\"\",COUNTA(H271:AA271))","v":""},null,null,null,null,null,null,null,null,null,null,null,null,null,null,null,null,null,null,null,null,null,null,0,{"$f":"AB271-AB270","v":0}]
[null,null,null,null,null,null,null,null,null,null,null,null,null,null,null,null,null,null,null,null,null,null,null,null,null,null,null,0]
[27,null,null,null,{"$f":"IF(COUNTA(H273:AA273)=0,\"\",COUNTA(H273:AA273))","v":""},null,null,null,null,null,null,null,null,null,null,null,null,null,null,null,null,null,null,null,null,null,null,0,{"$f":"AB273-AB272","v":0}]
[null,null,null,null,null,null,null,51,61,42,25,54,36,16,21,35,53,14,26,null,null,null,null,null,null,null,null,12]
[28," ",{"$f":"IF(G2292=\"\",\"\",G2292)","v":"高橋"},4,{"$f":"IF(COUNTA(H275:AA275)=0,\"\",COUNTA(H275:AA275))","v":12},"世史","高橋","*23","*23","*23","*23","*24","*24","*24","*24","*25","*25","*25","*25",null,null,null,null,null,null,null,null,12,{"$f":"AB275-AB274","v":0}]
[null,null,null,null,null,null,null,null,null,null,null,null,null,null,null,null,null,null,null,null,null,null,null,null,null,null,null,0]
[28," ",null,null,{"$f":"IF(COUNTA(H277:AA277)=0,\"\",COUNTA(H277:AA277))","v":""},null,null,null,null,null,null,null,null,null,null,null,null,null,null,null,null,null,null,null,null,null,null,0,{"$f":"AB277-AB276","v":0}]
[null,"・",null,null,null,null,null,null,null,null,null,null,null,null,null,null,null,null,null,null,null,null,null,null,null,null,null,0]
[28,null,null,null,{"$f":"IF(COUNTA(H279:AA279)=0,\"\",COUNTA(H279:AA279))","v":""},null,null,null,null,null,null,null,null,null,null,null,null,null,null,null,null,null,null,null,null,null,null,0,{"$f":"AB279-AB278","v":0}]
[null,null,null,null,null,null,null,null,null,null,null,null,null,null,null,null,null,null,null,null,null,null,null,null,null,null,null,0]
[28,null,null,null,{"$f":"IF(COUNTA(H281:AA281)=0,\"\",COUNTA(H281:AA281))","v":""},null,null,null,null,null,null,null,null,null,null,null,null,null,null,null,null,null,null,null,null,null,null,0,{"$f":"AB281-AB280","v":0}]
[null,null,null,null,null,null,null,null,null,null,null,null,null,null,null,null,null,null,null,null,null,null,null,null,null,null,null,0]
[28,null,null,null,{"$f":"IF(COUNTA(H283:AA283)=0,\"\",COUNTA(H283:AA283))","v":""},null,null,null,null,null,null,null,null,null,null,null,null,null,null,null,null,null,null,null,null,null,null,0,{"$f":"AB283-AB282","v":0}]
[null,null,null,null,null,null,null,null,null,null,null,null,null,null,null,null,null,null,null,null,null,null,null,null,null,null,null,0]
[29,null,{"$f":"IF(G2294=\"\",\"\",G2294)","v":"t29"},null,{"$f":"IF(COUNTA(H285:AA285)=0,\"\",COUNTA(H285:AA285))","v":""},null,null,null,null,null,null,null,null,null,null,null,null,null,null,null,null,null,null,null,null,null,null,0,{"$f":"AB285-AB284","v":0}]
[null,null,null,null,null,null,null,null,null,null,null,null,null,null,null,null,null,null,null,null,null,null,null,null,null,null,null,0]
[29,null,null,null,{"$f":"IF(COUNTA(H287:AA287)=0,\"\",COUNTA(H287:AA287))","v":""},null,null,null,null,null,null,null,null,null,null,null,null,null,null,null,null,null,null,null,null,null,null,0,{"$f":"AB287-AB286","v":0}]
[null,null,null,null,null,null,null,null,null,null,null,null,null,null,null,null,null,null,null,null,null,null,null,null,null,null,null,0]
[29,null,null,null,{"$f":"IF(COUNTA(H289:AA289)=0,\"\",COUNTA(H289:AA289))","v":""},null,null,null,null,null,null,null,null,null,null,null,null,null,null,null,null,null,null,null,null,null,null,0,{"$f":"AB289-AB288","v":0}]
[null,null,null,null,null,null,null,null,null,null,null,null,null,null,null,null,null,null,null,null,null,null,null,null,null,null,null,0]
[29,null,null,null,{"$f":"IF(COUNTA(H291:AA291)=0,\"\",COUNTA(H291:AA291))","v":""},null,null,null,null,null,null,null,null,null,null,null,null,null,null,null,null,null,null,null,null,null,null,0,{"$f":"AB291-AB290","v":0}]
[null,null,null,null,null,null,null,null,null,null,null,null,null,null,null,null,null,null,null,null,null,null,null,null,null,null,null,0]
[29,null,null,null,{"$f":"IF(COUNTA(H293:AA293)=0,\"\",COUNTA(H293:AA293))","v":""},null,null,null,null,null,null,null,null,null,null,null,null,null,null,null,null,null,null,null,null,null,null,0,{"$f":"AB293-AB292","v":0}]
[null,null,null,null,null,null,null,null,null,null,null,null,null,null,null,null,null,null,null,null,null,null,null,null,null,null,null,0]
[30," ",{"$f":"IF(G2296=\"\",\"\",G2296)","v":"t30"},null,{"$f":"IF(COUNTA(H295:AA295)=0,\"\",COUNTA(H295:AA295))","v":""},null,null,null,null,null,null,null,null,null,null,null,null,null,null,null,null,null,null,null,null,null,null,0,{"$f":"AB295-AB294","v":0}]
[null,null,null,null,null,null,null,null,null,null,null,null,null,null,null,null,null,null,null,null,null,null,null,null,null,null,null,0]
[30,null,null,null,{"$f":"IF(COUNTA(H297:AA297)=0,\"\",COUNTA(H297:AA297))","v":""},null,null,null,null,null,null,null,null,null,null,null,null,null,null,null,null,null,null,null,null,null,null,0,{"$f":"AB297-AB296","v":0}]
[null,null,null,null,null,null,null,null,null,null,null,null,null,null,null,null,null,null,null,null,null,null,null,null,null,null,null,0]
[30," ",null,null,{"$f":"IF(COUNTA(H299:AA299)=0,\"\",COUNTA(H299:AA299))","v":""},null,null,null,null,null,null,null,null,null,null,null,null,null,null,null,null,null,null,null,null,null,null,0,{"$f":"AB299-AB298","v":0}]
[null,null,null,null,null,null,null,null,null,null,null,null,null,null,null,null,null,null,null,null,null,null,null,null,null,null,null,0]
[30,null,null,null,{"$f":"IF(COUNTA(H301:AA301)=0,\"\",COUNTA(H301:AA301))","v":""},null,null,null,null,null,null,null,null,null,null,null,null,null,null,null,null,null,null,null,null,null,null,0,{"$f":"AB301-AB300","v":0}]
[null,null,null,null,null,null,null,null,null,null,null,null,null,null,null,null,null,null,null,null,null,null,null,null,null,null,null,0]
[30,null,null,null,{"$f":"IF(COUNTA(H303:AA303)=0,\"\",COUNTA(H303:AA303))","v":""},null,null,null,null,null,null,null,null,null,null,null,null,null,null,null,null,null,null,null,null,null,null,0,{"$f":"AB303-AB302","v":0}]
[null,"公",null,null,null,null,null,null,null,null,null,null,null,null,null,null,null,null,null,null,null,null,null,null,null,null,null,0]
[31," ",{"$f":"IF(G2298=\"\",\"\",G2298)","v":"t31"},null,{"$f":"IF(COUNTA(H305:AA305)=0,\"\",COUNTA(H305:AA305))","v":""},null,null,null,null,null,null,null,null,null,null,null,null,null,null,null,null,null,null,null,null,null,null,0,{"$f":"AB305-AB304","v":0}]
[null,null,null,null,null,null,null,null,null,null,null,null,null,null,null,null,null,null,null,null,null,null,null,null,null,null,null,0]
[31,null,null,null,{"$f":"IF(COUNTA(H307:AA307)=0,\"\",COUNTA(H307:AA307))","v":""},null,null,null,null,null,null,null,null,null,null,null,null,null,null,null,null,null,null,null,null,null,null,0,{"$f":"AB307-AB306","v":0}]
[null,null,null,null,null,null,null,null,null,null,null,null,null,null,null,null,null,null,null,null,null,null,null,null,null,null,null,0]
[31," ",null,null,{"$f":"IF(COUNTA(H309:AA309)=0,\"\",COUNTA(H309:AA309))","v":""},null,null,null,null,null,null,null,null,null,null,null,null,null,null,null,null,null,null,null,null,null,null,0,{"$f":"AB309-AB308","v":0}]
[null,null,null,null,null,null,null,null,null,null,null,null,null,null,null,null,null,null,null,null,null,null,null,null,null,null,null,0]
[31,null,null,null,{"$f":"IF(COUNTA(H311:AA311)=0,\"\",COUNTA(H311:AA311))","v":""},null,null,null,null,null,null,null,null,null,null,null,null,null,null,null,null,null,null,null,null,null,null,0,{"$f":"AB311-AB310","v":0}]
[null,null,null,null,null,null,null,null,null,null,null,null,null,null,null,null,null,null,null,null,null,null,null,null,null,null,null,0]
[31,null,null,null,{"$f":"IF(COUNTA(H313:AA313)=0,\"\",COUNTA(H313:AA313))","v":""},null,null,null,null,null,null,null,null,null,null,null,null,null,null,null,null,null,null,null,null,null,null,0,{"$f":"AB313-AB312","v":0}]
[null,null,null,null,null,null,null,null,null,null,null,null,null,null,null,null,null,null,null,null,null,null,null,null,null,null,null,0]
[32,null,{"$f":"IF(G2300=\"\",\"\",G2300)","v":"t32"},null,{"$f":"IF(COUNTA(H315:AA315)=0,\"\",COUNTA(H315:AA315))","v":""},null,null,null,null,null,null,null,null,null,null,null,null,null,null,null,null,null,null,null,null,null,null,0,{"$f":"AB315-AB314","v":0}]
[null,null,null,null,null,null,null,null,null,null,null,null,null,null,null,null,null,null,null,null,null,null,null,null,null,null,null,0]
[32,null,null,null,{"$f":"IF(COUNTA(H317:AA317)=0,\"\",COUNTA(H317:AA317))","v":""},null,null,null,null,null,null,null,null,null,null,null,null,null,null,null,null,null,null,null,null,null,null,0,{"$f":"AB317-AB316","v":0}]
[null,null,null,null,null,null,null,null,null,null,null,null,null,null,null,null,null,null,null,null,null,null,null,null,null,null,null,0]
[32,null,null,null,{"$f":"IF(COUNTA(H319:AA319)=0,\"\",COUNTA(H319:AA319))","v":""},null,null,null,null,null,null,null,null,null,null,null,null,null,null,null,null,null,null,null,null,null,null,0,{"$f":"AB319-AB318","v":0}]
[null,null,null,null,null,null,null,null,null,null,null,null,null,null,null,null,null,null,null,null,null,null,null,null,null,null,null,0]
[32,null,null,null,{"$f":"IF(COUNTA(H321:AA321)=0,\"\",COUNTA(H321:AA321))","v":""},null,null,null,null,null,null,null,null,null,null,null,null,null,null,null,null,null,null,null,null,null,null,0,{"$f":"AB321-AB320","v":0}]
[null,null,null,null,null,null,null,null,null,null,null,null,null,null,null,null,null,null,null,null,null,null,null,null,null,null,null,0]
[32,null,null,null,{"$f":"IF(COUNTA(H323:AA323)=0,\"\",COUNTA(H323:AA323))","v":""},null,null,null,null,null,null,null,null,null,null,null,null,null,null,null,null,null,null,null,null,null,null,0,{"$f":"AB323-AB322","v":0}]
[null,null,null,null,null,null,null,null,null,null,null,null,null,null,null,null,null,null,null,null,null,null,null,null,null,null,null,{"$f":"COUNTA(H324:AA324)","v":0}]
[33,null,{"$f":"IF(G2302=\"\",\"\",G2302)","v":"t33"},null,{"$f":"IF(COUNTA(H325:AA325)=0,\"\",COUNTA(H325:AA325))","v":""},null,null,null,null,null,null,null,null,null,null,null,null,null,null,null,null,null,null,null,null,null,null,0,{"$f":"AB325-AB324","v":0}]
[null,null,null,null,null,null,null,null,null,null,null,null,null,null,null,null,null,null,null,null,null,null,null,null,null,null,null,0]
[33,null,null,null,{"$f":"IF(COUNTA(H327:AA327)=0,\"\",COUNTA(H327:AA327))","v":""},null,null,null,null,null,null,null,null,null,null,null,null,null,null,null,null,null,null,null,null,null,null,0,{"$f":"AB327-AB326","v":0}]
[null,null,null,null,null,null,null,null,null,null,null,null,null,null,null,null,null,null,null,null,null,null,null,null,null,null,null,0]
[33,null,null,null,{"$f":"IF(COUNTA(H329:AA329)=0,\"\",COUNTA(H329:AA329))","v":""},null,null,null,null,null,null,null,null,null,null,null,null,null,null,null,null,null,null,null,null,null,null,0,{"$f":"AB329-AB328","v":0}]
[null,null,null,null,null,null,null,null,null,null,null,null,null,null,null,null,null,null,null,null,null,null,null,null,null,null,null,0]
[33,null,null,null,{"$f":"IF(COUNTA(H331:AA331)=0,\"\",COUNTA(H331:AA331))","v":""},null,null,null,null,null,null,null,null,null,null,null,null,null,null,null,null,null,null,null,null,null,null,0,{"$f":"AB331-AB330","v":0}]
[null,null,null,null,null,null,null,null,null,null,null,null,null,null,null,null,null,null,null,null,null,null,null,null,null,null,null,0]
[33,null,null,null,{"$f":"IF(COUNTA(H333:AA333)=0,\"\",COUNTA(H333:AA333))","v":""},null,null,null,null,null,null,null,null,null,null,null,null,null,null,null,null,null,null,null,null,null,null,0,{"$f":"AB333-AB332","v":0}]
[null,null,null,null,null,null,null,null,null,null,null,null,null,null,null,null,null,null,null,null,null,null,null,null,null,null,null,0]
[34,null,{"$f":"IF(G2304=\"\",\"\",G2304)","v":"t34"},null,{"$f":"IF(COUNTA(H335:AA335)=0,\"\",COUNTA(H335:AA335))","v":""},null,null,null,null,null,null,null,null,null,null,null,null,null,null,null,null,null,null,null,null,null,null,0,{"$f":"AB335-AB334","v":0}]
[null,null,null,null,null,null,null,null,null,null,null,null,null,null,null,null,null,null,null,null,null,null,null,null,null,null,null,0]
[34,null,null,null,{"$f":"IF(COUNTA(H337:AA337)=0,\"\",COUNTA(H337:AA337))","v":""},null,null,null,null,null,null,null,null,null,null,null,null,null,null,null,null,null,null,null,null,null,null,0,{"$f":"AB337-AB336","v":0}]
[null,null,null,null,null,null,null,null,null,null,null,null,null,null,null,null,null,null,null,null,null,null,null,null,null,null,null,0]
[34,null,null,null,{"$f":"IF(COUNTA(H339:AA339)=0,\"\",COUNTA(H339:AA339))","v":""},null,null,null,null,null,null,null,null,null,null,null,null,null,null,null,null,null,null,null,null,null,null,0,{"$f":"AB339-AB338","v":0}]
[null,null,null,null,null,null,null,null,null,null,null,null,null,null,null,null,null,null,null,null,null,null,null,null,null,null,null,0]
[34,null,null,null,{"$f":"IF(COUNTA(H341:AA341)=0,\"\",COUNTA(H341:AA341))","v":""},null,null,null,null,null,null,null,null,null,null,null,null,null,null,null,null,null,null,null,null,null,null,0,{"$f":"AB341-AB340","v":0}]
[null,null,null,null,null,null,null,null,null,null,null,null,null,null,null,null,null,null,null,null,null,null,null,null,null,null,null,0]
[34,"民",null,null,{"$f":"IF(COUNTA(H343:AA343)=0,\"\",COUNTA(H343:AA343))","v":""},null,null,null,null,null,null,null,null,null,null,null,null,null,null,null,null,null,null,null,null,null,null,0,{"$f":"AB343-AB342","v":0}]
[null,null,null,null,null,null,null,null,null,null,null,null,null,null,null,null,null,null,null,null,null,null,null,null,null,null,null,0]
[35,null,{"$f":"G2306","v":"t35"},null,null,null,null,null,null,null,null,null,null,null,null,null,null,null,null,null,null,null,null,null,null,null,null,0,{"$f":"AB345-AB344","v":0}]
[null,null,null,null,null,null,null,null,null,null,null,null,null,null,null,null,null,null,null,null,null,null,null,null,null,null,null,0]
[35,null,null,null,null,null,null,null,null,null,null,null,null,null,null,null,null,null,null,null,null,null,null,null,null,null,null,0,{"$f":"AB347-AB346","v":0}]
[null,null,null,null,null,null,null,null,null,null,null,null,null,null,null,null,null,null,null,null,null,null,null,null,null,null,null,0]
[35,null,null,null,null,null,null,null,null,null,null,null,null,null,null,null,null,null,null,null,null,null,null,null,null,null,null,0,{"$f":"AB349-AB348","v":0}]
[null,null,null,null,null,null,null,null,null,null,null,null,null,null,null,null,null,null,null,null,null,null,null,null,null,null,null,0]
[35,null,null,null,null,null,null,null,null,null,null,null,null,null,null,null,null,null,null,null,null,null,null,null,null,null,null,0,{"$f":"AB351-AB350","v":0}]
[null,null,null,null,null,null,null,null,null,null,null,null,null,null,null,null,null,null,null,null,null,null,null,null,null,null,null,0]
[35,null,null,null,null,null,null,null,null,null,null,null,null,null,null,null,null,null,null,null,null,null,null,null,null,null,null,0,{"$f":"AB353-AB352","v":0}]
[null,null,null,null,null,null,null,null,null,null,null,null,null,null,null,null,null,null,null,null,null,null,null,null,null,null,null,0]
[36,null,{"$f":"G2308","v":"t36"},null,null,null,null,null,null,null,null,null,null,null,null,null,null,null,null,null,null,null,null,null,null,null,null,0,{"$f":"AB355-AB354","v":0}]
[null,null,null,null,null,null,null,null,null,null,null,null,null,null,null,null,null,null,null,null,null,null,null,null,null,null,null,0]
[36,null,null,null,null,null,null,null,null,null,null,null,null,null,null,null,null,null,null,null,null,null,null,null,null,null,null,0,{"$f":"AB357-AB356","v":0}]
[null,null,null,null,null,null,null,null,null,null,null,null,null,null,null,null,null,null,null,null,null,null,null,null,null,null,null,0]
[36,null,null,null,null,null,null,null,null,null,null,null,null,null,null,null,null,null,null,null,null,null,null,null,null,null,null,0,{"$f":"AB359-AB358","v":0}]
[null,null,null,null,null,null,null,null,null,null,null,null,null,null,null,null,null,null,null,null,null,null,null,null,null,null,null,0]
[36,null,null,null,null,null,null,null,null,null,null,null,null,null,null,null,null,null,null,null,null,null,null,null,null,null,null,0,{"$f":"AB361-AB360","v":0}]
[null,null,null,null,null,null,null,null,null,null,null,null,null,null,null,null,null,null,null,null,null,null,null,null,null,null,null,0]
[36,null,null,null,null,null,null,null,null,null,null,null,null,null,null,null,null,null,null,null,null,null,null,null,null,null,null,0,{"$f":"AB363-AB362","v":0}]
[null,null,null,null,null,null,null,null,null,null,null,null,null,null,null,null,null,null,null,null,null,null,null,null,null,null,null,0]
[37,null,{"$f":"G2310","v":"t37"},null,null,null,null,null,null,null,null,null,null,null,null,null,null,null,null,null,null,null,null,null,null,null,null,0,{"$f":"AB365-AB364","v":0}]
[null,null,null,null,null,null,null,null,null,null,null,null,null,null,null,null,null,null,null,null,null,null,null,null,null,null,null,0]
[37,null,null,null,null,null,null,null,null,null,null,null,null,null,null,null,null,null,null,null,null,null,null,null,null,null,null,0,{"$f":"AB367-AB366","v":0}]
[null,null,null,null,null,null,null,null,null,null,null,null,null,null,null,null,null,null,null,null,null,null,null,null,null,null,null,0]
[37,null,null,null,null,null,null,null,null,null,null,null,null,null,null,null,null,null,null,null,null,null,null,null,null,null,null,0,{"$f":"AB369-AB368","v":0}]
[null,null,null,null,null,null,null,null,null,null,null,null,null,null,null,null,null,null,null,null,null,null,null,null,null,null,null,0]
[37,null,null,null,null,null,null,null,null,null,null,null,null,null,null,null,null,null,null,null,null,null,null,null,null,null,null,0,{"$f":"AB371-AB370","v":0}]
[null,null,null,null,null,null,null,null,null,null,null,null,null,null,null,null,null,null,null,null,null,null,null,null,null,null,null,0]
[37,null,null,null,null,null,null,null,null,null,null,null,null,null,null,null,null,null,null,null,null,null,null,null,null,null,null,0,{"$f":"AB373-AB372","v":0}]
[null,null,null,null,null,null,null,null,null,null,null,null,null,null,null,null,null,null,null,null,null,null,null,null,null,null,null,0]
[38,null,{"$f":"G2312","v":"t38"},null,null,null,null,null,null,null,null,null,null,null,null,null,null,null,null,null,null,null,null,null,null,null,null,0,{"$f":"AB375-AB374","v":0}]
[null,null,null,null,null,null,null,null,null,null,null,null,null,null,null,null,null,null,null,null,null,null,null,null,null,null,null,0]
[38,null,null,null,null,null,null,null,null,null,null,null,null,null,null,null,null,null,null,null,null,null,null,null,null,null,null,0,{"$f":"AB377-AB376","v":0}]
[null,null,null,null,null,null,null,null,null,null,null,null,null,null,null,null,null,null,null,null,null,null,null,null,null,null,null,0]
[38,null,null,null,null,null,null,null,null,null,null,null,null,null,null,null,null,null,null,null,null,null,null,null,null,null,null,0,{"$f":"AB379-AB378","v":0}]
[null,null,null,null,null,null,null,null,null,null,null,null,null,null,null,null,null,null,null,null,null,null,null,null,null,null,null,0]
[38,null,null,null,null,null,null,null,null,null,null,null,null,null,null,null,null,null,null,null,null,null,null,null,null,null,null,0,{"$f":"AB381-AB380","v":0}]
[null,null,null,null,null,null,null,null,null,null,null,null,null,null,null,null,null,null,null,null,null,null,null,null,null,null,null,0]
[38,null,null,null,null,null,null,null,null,null,null,null,null,null,null,null,null,null,null,null,null,null,null,null,null,null,null,0,{"$f":"AB383-AB382","v":0}]
[null,null,null,null,null,null,null,null,null,null,null,null,null,null,null,null,null,null,null,null,null,null,null,null,null,null,null,0]
[39,null,{"$f":"G2314","v":"t39"},null,null,null,null,null,null,null,null,null,null,null,null,null,null,null,null,null,null,null,null,null,null,null,null,0,{"$f":"AB385-AB384","v":0}]
[null,null,null,null,null,null,null,null,null,null,null,null,null,null,null,null,null,null,null,null,null,null,null,null,null,null,null,0]
[39,null,null,null,null,null,null,null,null,null,null,null,null,null,null,null,null,null,null,null,null,null,null,null,null,null,null,0,{"$f":"AB387-AB386","v":0}]
[null,null,null,null,null,null,null,null,null,null,null,null,null,null,null,null,null,null,null,null,null,null,null,null,null,null,null,{"$f":"COUNTA(H388:AA388)","v":0}]
[39,null,null,null,null,null,null,null,null,null,null,null,null,null,null,null,null,null,null,null,null,null,null,null,null,null,null,0,{"$f":"AB389-AB388","v":0}]
[null,null,null,null,null,null,null,null,null,null,null,null,null,null,null,null,null,null,null,null,null,null,null,null,null,null,null,0]
[39,null,null,null,null,null,null,null,null,null,null,null,null,null,null,null,null,null,null,null,null,null,null,null,null,null,null,0,{"$f":"AB391-AB390","v":0}]
[null,null,null,null,null,null,null,null,null,null,null,null,null,null,null,null,null,null,null,null,null,null,null,null,null,null,null,0]
[39,null,null,null,null,null,null,null,null,null,null,null,null,null,null,null,null,null,null,null,null,null,null,null,null,null,null,0,{"$f":"AB393-AB392","v":0}]
[null,null,null,null,null,null,null,null,null,null,null,null,null,null,null,null,null,null,null,null,null,null,null,null,null,null,null,0]
[40,null,{"$f":"IF(G2316=\"\",\"\",G2316)","v":"t40"},null,{"$f":"IF(COUNTA(H395:AA395)=0,\"\",COUNTA(H395:AA395))","v":""},null,null,null,null,null,null,null,null,null,null,null,null,null,null,null,null,null,null,null,null,null,null,0,{"$f":"AB395-AB394","v":0}]
[null,null,null,null,null,null,null,null,null,null,null,null,null,null,null,null,null,null,null,null,null,null,null,null,null,null,null,0]
[40,null,null,null,{"$f":"IF(COUNTA(H397:AA397)=0,\"\",COUNTA(H397:AA397))","v":""},null,null,null,null,null,null,null,null,null,null,null,null,null,null,null,null,null,null,null,null,null,null,0,{"$f":"AB397-AB396","v":0}]
[null,null,null,null,null,null,null,null,null,null,null,null,null,null,null,null,null,null,null,null,null,null,null,null,null,null,null,0]
[40,null,null,null,{"$f":"IF(COUNTA(H399:AA399)=0,\"\",COUNTA(H399:AA399))","v":""},null,null,null,null,null,null,null,null,null,null,null,null,null,null,null,null,null,null,null,null,null,null,0,{"$f":"AB399-AB398","v":0}]
[null,null,null,null,null,null,null,null,null,null,null,null,null,null,null,null,null,null,null,null,null,null,null,null,null,null,null,0]
[40," ",null,null,{"$f":"IF(COUNTA(H401:AA401)=0,\"\",COUNTA(H401:AA401))","v":""},null,null,null,null,null,null,null,null,null,null,null,null,null,null,null,null,null,null,null,null,null,null,0,{"$f":"AB401-AB400","v":0}]
[null,null,null,null,null,null,null,null,null,null,null,null,null,null,null,null,null,null,null,null,null,null,null,null,null,null,null,0]
[40,null,null,null,{"$f":"IF(COUNTA(H403:AA403)=0,\"\",COUNTA(H403:AA403))","v":""},null,null,null,null,null,null,null,null,null,null,null,null,null,null,null,null,null,null,null,null,null,null,0,{"$f":"AB403-AB402","v":0}]
[null,null,null,null,null,null,null,36,62,55,24,44,13,23,33,31,11,52,42,22,51,12,34,null,null,null,null,16]
[41,null,{"$f":"IF(G2318=\"\",\"\",G2318)","v":"金子"},4,{"$f":"IF(COUNTA(H405:AA405)=0,\"\",COUNTA(H405:AA405))","v":16},"数Ⅰ","金子","*15","*15","*15","*15","*16","*16","*16","*16","*17","*17","*17","*17","*18","*18","*18","*18",null,null,null,null,16,{"$f":"AB405-AB404","v":0}]
[null,null,null,null,null,null,null,null,null,null,null,null,null,null,null,null,null,null,null,null,null,null,null,null,null,null,null,0]
[41,null,null,null,{"$f":"IF(COUNTA(H407:AA407)=0,\"\",COUNTA(H407:AA407))","v":""},null,null,null,null,null,null,null,null,null,null,null,null,null,null,null,null,null,null,null,null,null,null,0,{"$f":"AB407-AB406","v":0}]
[null,null,null,null,null,null,null,null,null,null,null,null,null,null,null,null,null,null,null,null,null,null,null,null,null,null,null,0]
[41,null,null,null,{"$f":"IF(COUNTA(H409:AA409)=0,\"\",COUNTA(H409:AA409))","v":""},null,null,null,null,null,null,null,null,null,null,null,null,null,null,null,null,null,null,null,null,null,null,0,{"$f":"AB409-AB408","v":0}]
[null,null,null,null,null,null,null,null,null,null,null,null,null,null,null,null,null,null,null,null,null,null,null,null,null,null,null,0]
[41,null,null,null,{"$f":"IF(COUNTA(H411:AA411)=0,\"\",COUNTA(H411:AA411))","v":""},null,null,null,null,null,null,null,null,null,null,null,null,null,null,null,null,null,null,null,null,null,null,0,{"$f":"AB411-AB410","v":0}]
[null,null,null,null,null,null,null,46,null,null,null,null,null,null,null,null,null,null,null,null,null,null,null,null,null,null,null,1]
[41,null,null,null,{"$f":"IF(COUNTA(H413:AA413)=0,\"\",COUNTA(H413:AA413))","v":1},"LHR","金子","*18",null,null,null,null,null,null,null,null,null,null,null,null,null,null,null,null,null,null,null,1,{"$f":"AB413-AB412","v":0}]
[null,null,null,null,null,null,null,54,13,32,44,21,43,14,55,null,null,null,null,null,null,null,null,null,null,null,null,8]
[42,null,{"$f":"IF(G2320=\"\",\"\",G2320)","v":"山根ﾀ"},4,{"$f":"IF(COUNTA(H415:AA415)=0,\"\",COUNTA(H415:AA415))","v":8},"数Ⅰ","山根ﾀ","*12","*12","*12","*12","*13","*13","*13","*13",null,null,null,null,null,null,null,null,null,null,null,null,8,{"$f":"AB415-AB414","v":0}]
[null,null,null,null,null,null,null,36,22,12,61,24,34,11,42,null,null,null,null,null,null,null,null,null,null,null,null,8]
[42,null,null,4,{"$f":"IF(COUNTA(H417:AA417)=0,\"\",COUNTA(H417:AA417))","v":8},"数Ⅱ","山根ﾀ","*21","*21","*21","*21","*25","*25","*25","*25",null,null,null,null,null,null,null,null,null,null,null,null,8,{"$f":"AB417-AB416","v":0}]
[null,null,null,null,null,null,null,null,null,null,null,null,null,null,null,null,null,null,null,null,null,null,null,null,null,null,null,0]
[42,null,null,null,{"$f":"IF(COUNTA(H419:AA419)=0,\"\",COUNTA(H419:AA419))","v":""},null,null,null,null,null,null,null,null,null,null,null,null,null,null,null,null,null,null,null,null,null,null,0,{"$f":"AB419-AB418","v":0}]
[null,null,null,null,null,null,null,null,null,null,null,null,null,null,null,null,null,null,null,null,null,null,null,null,null,null,null,0]
[42,null,null,null,{"$f":"IF(COUNTA(H421:AA421)=0,\"\",COUNTA(H421:AA421))","v":""},null,null,null,null,null,null,null,null,null,null,null,null,null,null,null,null,null,null,null,null,null,null,0,{"$f":"AB421-AB420","v":0}]
[null,null,null,null,null,null,null,null,null,null,null,null,null,null,null,null,null,null,null,null,null,null,null,null,null,null,null,0]
[42,null,null,null,{"$f":"IF(COUNTA(H423:AA423)=0,\"\",COUNTA(H423:AA423))","v":""},null,null,null,null,null,null,null,null,null,null,null,null,null,null,null,null,null,null,null,null,null,null,0,{"$f":"AB423-AB422","v":0}]
[null,null,null,null,null,null,null,36,44,52,11,null,null,null,null,null,null,null,null,null,null,null,null,null,null,null,null,4]
[43,"数",{"$f":"IF(G2322=\"\",\"\",G2322)","v":"斉藤ﾄ"},4,{"$f":"IF(COUNTA(H425:AA425)=0,\"\",COUNTA(H425:AA425))","v":4},"数Ⅰ","斉藤ﾄ","*14","*14","*14","*14",null,null,null,null,null,null,null,null,null,null,null,null,null,null,null,null,4,{"$f":"AB425-AB424","v":0}]
[null,null,null,null,null,null,null,45,12,34,61,21,15,54,35,32,51,25,62,null,null,null,null,null,null,null,null,12]
[43," ",null,4,{"$f":"IF(COUNTA(H427:AA427)=0,\"\",COUNTA(H427:AA427))","v":12},"数Ⅱ","斉藤ﾄ","*22","*22","*22","*22","*23","*23","*23","*23","*24","*24","*24","*24",null,null,null,null,null,null,null,null,12,{"$f":"AB427-AB426","v":0}]
[null,null,null,null,null,null,null,null,null,null,null,null,null,null,null,null,null,null,null,null,null,null,null,null,null,null,null,0]
[43,null,null,null,{"$f":"IF(COUNTA(H429:AA429)=0,\"\",COUNTA(H429:AA429))","v":""},null,null,null,null,null,null,null,null,null,null,null,null,null,null,null,null,null,null,null,null,null,null,0,{"$f":"AB429-AB428","v":0}]
[null,null,null,null,null,null,null,null,null,null,null,null,null,null,null,null,null,null,null,null,null,null,null,null,null,null,null,0]
[43,null,null,null,{"$f":"IF(COUNTA(H431:AA431)=0,\"\",COUNTA(H431:AA431))","v":""},null,null,null,null,null,null,null,null,null,null,null,null,null,null,null,null,null,null,null,null,null,null,0,{"$f":"AB431-AB430","v":0}]
[null,null,null,null,null,null,null,46,null,null,null,null,null,null,null,null,null,null,null,null,null,null,null,null,null,null,null,1]
[43,null,null,null,{"$f":"IF(COUNTA(H433:AA433)=0,\"\",COUNTA(H433:AA433))","v":1},"LHR","斉藤ﾄ","*23",null,null,null,null,null,null,null,null,null,null,null,null,null,null,null,null,null,null,null,1,{"$f":"AB433-AB432","v":0}]
[null,null,null,null,null,null,null,35,12,45,23,null,null,null,null,null,null,null,null,null,null,null,null,null,null,null,null,4]
[44,null,{"$f":"IF(G2324=\"\",\"\",G2324)","v":"市ノ川"},4,{"$f":"IF(COUNTA(H435:AA435)=0,\"\",COUNTA(H435:AA435))","v":4},"数Ⅰ","市ノ川","*11","*11","*11","*11",null,null,null,null,null,null,null,null,null,null,null,null,null,null,null,null,4,{"$f":"AB435-AB434","v":0}]
[null,null,null,null,null,null,null,11,21,61,41,22,13,33,null,16,62,null,null,null,null,null,null,null,null,null,null,9]
[44,null,null,4,{"$f":"IF(COUNTA(H437:AA437)=0,\"\",COUNTA(H437:AA437))","v":12},"数Ⅱ","市ノ川","*26","*26","*26","*26","*27","*27","*27","*27","*28","*28","*28","*28",null,null,null,null,null,null,null,null,12,{"$f":"AB437-AB436","v":3}]
[null,null,null,null,null,null,null,null,null,null,null,null,null,null,null,null,null,null,null,null,null,null,null,null,null,null,null,0]
[44,null,null,null,{"$f":"IF(COUNTA(H439:AA439)=0,\"\",COUNTA(H439:AA439))","v":""},null,null,null,null,null,null,null,null,null,null,null,null,null,null,null,null,null,null,null,null,null,null,0,{"$f":"AB439-AB438","v":0}]
[null,null,null,null,null,null,null,null,null,null,null,null,null,null,null,null,null,null,null,null,null,null,null,null,null,null,null,0]
[44,null,null,null,{"$f":"IF(COUNTA(H441:AA441)=0,\"\",COUNTA(H441:AA441))","v":""},null,null,null,null,null,null,null,null,null,null,null,null,null,null,null,null,null,null,null,null,null,null,0,{"$f":"AB441-AB440","v":0}]
[null,null,null,null,null,null,null,46,null,null,null,null,null,null,null,null,null,null,null,null,null,null,null,null,null,null,null,1]
[44," ",null,null,{"$f":"IF(COUNTA(H443:AA443)=0,\"\",COUNTA(H443:AA443))","v":1},"LHR","市ノ川","*28",null,null,null,null,null,null,null,null,null,null,null,null,null,null,null,null,null,null,null,1,{"$f":"AB443-AB442","v":0}]
[null,null,null,null,null,null,null,36,null,51,44,14,41,26,null,null,null,null,null,null,null,null,null,null,null,null,null,6]
[45,null,{"$f":"IF(G2326=\"\",\"\",G2326)","v":"多田"},2,{"$f":"IF(COUNTA(H445:AA445)=0,\"\",COUNTA(H445:AA445))","v":8},"数Ⅱ","多田","*31","*31","*32","*32","*33","*33","*34","*34",null,null,null,null,null,null,null,null,null,null,null,null,8,{"$f":"AB445-AB444","v":2}]
[null,null,null,null,null,null,null,11,55,42,33,null,null,null,null,null,null,null,null,null,null,null,null,null,null,null,null,4]
[45,null,null,4,{"$f":"IF(COUNTA(H447:AA447)=0,\"\",COUNTA(H447:AA447))","v":4},"数Ⅲ","多田","*35","*35","*35","*35",null,null,null,null,null,null,null,null,null,null,null,null,null,null,null,null,4,{"$f":"AB447-AB446","v":0}]
[null,null,null,null,null,null,null,null,null,null,null,null,null,null,null,null,null,null,null,null,null,null,null,null,null,null,null,0]
[45,null,null,null,{"$f":"IF(COUNTA(H449:AA449)=0,\"\",COUNTA(H449:AA449))","v":""},null,null,null,null,null,null,null,null,null,null,null,null,null,null,null,null,null,null,null,null,null,null,0,{"$f":"AB449-AB448","v":0}]
[null,null,null,null,null,null,null,null,null,null,null,null,null,null,null,null,null,null,null,null,null,null,null,null,null,null,null,0]
[45,null,null,null,{"$f":"IF(COUNTA(H451:AA451)=0,\"\",COUNTA(H451:AA451))","v":""},null,null,null,null,null,null,null,null,null,null,null,null,null,null,null,null,null,null,null,null,null,null,0,{"$f":"AB451-AB450","v":0}]
[null,null,null,null,null,null,null,46,null,null,null,null,null,null,null,null,null,null,null,null,null,null,null,null,null,null,null,{"$f":"COUNTA(H452:AA452)","v":1}]
[45,null,null,null,{"$f":"IF(COUNTA(H453:AA453)=0,\"\",COUNTA(H453:AA453))","v":1},"LHR","多田","*34",null,null,null,null,null,null,null,null,null,null,null,null,null,null,null,null,null,null,null,1,{"$f":"AB453-AB452","v":0}]
[null,null,null,null,null,null,null,null,null,24,31,32,null,null,null,null,null,null,null,null,null,null,null,null,null,null,null,3]
[46,null,{"$f":"IF(G2328=\"\",\"\",G2328)","v":"菊川"},2,{"$f":"IF(COUNTA(H455:AA455)=0,\"\",COUNTA(H455:AA455))","v":6},"数Ⅱ","菊川","*36","*36","*37","*37","*38","*38",null,null,null,null,null,null,null,null,null,null,null,null,null,null,6,{"$f":"AB455-AB454","v":3}]
[null,null,null,null,null,null,null,44,null,null,null,null,null,null,null,null,null,null,null,null,null,null,null,null,null,null,null,1]
[46," ",null,2,{"$f":"IF(COUNTA(H457:AA457)=0,\"\",COUNTA(H457:AA457))","v":2},"数Ｂ","菊川","*35","*35",null,null,null,null,null,null,null,null,null,null,null,null,null,null,null,null,null,null,2,{"$f":"AB457-AB456","v":1}]
[null,null,null,null,null,null,null,null,null,null,null,null,null,null,null,null,null,null,null,null,null,null,null,null,null,null,null,0]
[46,null,null,null,{"$f":"IF(COUNTA(H459:AA459)=0,\"\",COUNTA(H459:AA459))","v":""},null,null,null,null,null,null,null,null,null,null,null,null,null,null,null,null,null,null,null,null,null,null,0,{"$f":"AB459-AB458","v":0}]
[null,null,null,null,null,null,null,null,null,null,null,null,null,null,null,null,null,null,null,null,null,null,null,null,null,null,null,0]
[46,null,null,null,{"$f":"IF(COUNTA(H461:AA461)=0,\"\",COUNTA(H461:AA461))","v":""},null,null,null,null,null,null,null,null,null,null,null,null,null,null,null,null,null,null,null,null,null,null,0,{"$f":"AB461-AB460","v":0}]
[null,null,null,null,null,null,null,null,null,null,null,null,null,null,null,null,null,null,null,null,null,null,null,null,null,null,null,0]
[46,null,null,null,{"$f":"IF(COUNTA(H463:AA463)=0,\"\",COUNTA(H463:AA463))","v":""},null,null,null,null,null,null,null,null,null,null,null,null,null,null,null,null,null,null,null,null,null,null,0,{"$f":"AB463-AB462","v":0}]
[null,null,null,null,null,null,null,null,null,null,null,null,null,null,null,null,null,null,null,null,null,null,null,null,null,null,null,0]
[47,null,{"$f":"IF(G2330=\"\",\"\",G2330)","v":"t47"},null,{"$f":"IF(COUNTA(H465:AA465)=0,\"\",COUNTA(H465:AA465))","v":""},null,null,null,null,null,null,null,null,null,null,null,null,null,null,null,null,null,null,null,null,null,null,0,{"$f":"AB465-AB464","v":0}]
[null,null,null,null,null,null,null,null,null,null,null,null,null,null,null,null,null,null,null,null,null,null,null,null,null,null,null,0]
[47,null,null,null,{"$f":"IF(COUNTA(H467:AA467)=0,\"\",COUNTA(H467:AA467))","v":""},null,null,null,null,null,null,null,null,null,null,null,null,null,null,null,null,null,null,null,null,null,null,0,{"$f":"AB467-AB466","v":0}]
[null,null,null,null,null,null,null,null,null,null,null,null,null,null,null,null,null,null,null,null,null,null,null,null,null,null,null,0]
[47,null,null,null,{"$f":"IF(COUNTA(H469:AA469)=0,\"\",COUNTA(H469:AA469))","v":""},null,null,null,null,null,null,null,null,null,null,null,null,null,null,null,null,null,null,null,null,null,null,0,{"$f":"AB469-AB468","v":0}]
[null,null,null,null,null,null,null,null,null,null,null,null,null,null,null,null,null,null,null,null,null,null,null,null,null,null,null,0]
[47,null,null,null,{"$f":"IF(COUNTA(H471:AA471)=0,\"\",COUNTA(H471:AA471))","v":""},null,null,null,null,null,null,null,null,null,null,null,null,null,null,null,null,null,null,null,null,null,null,0,{"$f":"AB471-AB470","v":0}]
[null,null,null,null,null,null,null,null,null,null,null,null,null,null,null,null,null,null,null,null,null,null,null,null,null,null,null,0]
[47,null,null,null,{"$f":"IF(COUNTA(H473:AA473)=0,\"\",COUNTA(H473:AA473))","v":""},null,null,null,null,null,null,null,null,null,null,null,null,null,null,null,null,null,null,null,null,null,null,0,{"$f":"AB473-AB472","v":0}]
[null,null,null,null,null,null,null,null,null,null,null,null,null,null,null,null,null,null,null,null,null,null,null,null,null,null,null,0]
[48,null,{"$f":"IF(G2332=\"\",\"\",G2332)","v":"t48"},null,{"$f":"IF(COUNTA(H475:AA475)=0,\"\",COUNTA(H475:AA475))","v":""},null,null,null,null,null,null,null,null,null,null,null,null,null,null,null,null,null,null,null,null,null,null,0,{"$f":"AB475-AB474","v":0}]
[null,null,null,null,null,null,null,null,null,null,null,null,null,null,null,null,null,null,null,null,null,null,null,null,null,null,null,0]
[48,null,null,null,{"$f":"IF(COUNTA(H477:AA477)=0,\"\",COUNTA(H477:AA477))","v":""},null,null,null,null,null,null,null,null,null,null,null,null,null,null,null,null,null,null,null,null,null,null,0,{"$f":"AB477-AB476","v":0}]
[null,null,null,null,null,null,null,null,null,null,null,null,null,null,null,null,null,null,null,null,null,null,null,null,null,null,null,0]
[48,null,null,null,{"$f":"IF(COUNTA(H479:AA479)=0,\"\",COUNTA(H479:AA479))","v":""},null,null,null,null,null,null,null,null,null,null,null,null,null,null,null,null,null,null,null,null,null,null,0,{"$f":"AB479-AB478","v":0}]
[null,null,null,null,null,null,null,null,null,null,null,null,null,null,null,null,null,null,null,null,null,null,null,null,null,null,null,0]
[48," ",null,null,{"$f":"IF(COUNTA(H481:AA481)=0,\"\",COUNTA(H481:AA481))","v":""},null,null,null,null,null,null,null,null,null,null,null,null,null,null,null,null,null,null,null,null,null,null,0,{"$f":"AB481-AB480","v":0}]
[null,null,null,null,null,null,null,null,null,null,null,null,null,null,null,null,null,null,null,null,null,null,null,null,null,null,null,0]
[48,null,null,null,{"$f":"IF(COUNTA(H483:AA483)=0,\"\",COUNTA(H483:AA483))","v":""},null,null,null,null,null,null,null,null,null,null,null,null,null,null,null,null,null,null,null,null,null,null,0,{"$f":"AB483-AB482","v":0}]
[null,null,null,null,null,null,null,null,null,null,null,null,null,null,null,null,null,null,null,null,null,null,null,null,null,null,null,0]
[49," ",{"$f":"IF(G2334=\"\",\"\",G2334)","v":"t49"},null,{"$f":"IF(COUNTA(H485:AA485)=0,\"\",COUNTA(H485:AA485))","v":""},null,null,null,null,null,null,null,null,null,null,null,null,null,null,null,null,null,null,null,null,null,null,0,{"$f":"AB485-AB484","v":0}]
[null,null,null,null,null,null,null,null,null,null,null,null,null,null,null,null,null,null,null,null,null,null,null,null,null,null,null,0]
[49,null,null,null,{"$f":"IF(COUNTA(H487:AA487)=0,\"\",COUNTA(H487:AA487))","v":""},null,null,null,null,null,null,null,null,null,null,null,null,null,null,null,null,null,null,null,null,null,null,0,{"$f":"AB487-AB486","v":0}]
[null,null,null,null,null,null,null,null,null,null,null,null,null,null,null,null,null,null,null,null,null,null,null,null,null,null,null,0]
[49,null,null,null,{"$f":"IF(COUNTA(H489:AA489)=0,\"\",COUNTA(H489:AA489))","v":""},null,null,null,null,null,null,null,null,null,null,null,null,null,null,null,null,null,null,null,null,null,null,0,{"$f":"AB489-AB488","v":0}]
[null,null,null,null,null,null,null,null,null,null,null,null,null,null,null,null,null,null,null,null,null,null,null,null,null,null,null,0]
[49,null,null,null,{"$f":"IF(COUNTA(H491:AA491)=0,\"\",COUNTA(H491:AA491))","v":""},null,null,null,null,null,null,null,null,null,null,null,null,null,null,null,null,null,null,null,null,null,null,0,{"$f":"AB491-AB490","v":0}]
[null,null,null,null,null,null,null,null,null,null,null,null,null,null,null,null,null,null,null,null,null,null,null,null,null,null,null,0]
[49,null,null,null,{"$f":"IF(COUNTA(H493:AA493)=0,\"\",COUNTA(H493:AA493))","v":""},null,null,null,null,null,null,null,null,null,null,null,null,null,null,null,null,null,null,null,null,null,null,0,{"$f":"AB493-AB492","v":0}]
[null,null,null,null,null,null,null,null,null,null,null,null,null,null,null,null,null,null,null,null,null,null,null,null,null,null,null,0]
[50,null,{"$f":"IF(G2336=\"\",\"\",G2336)","v":"t50"},null,{"$f":"IF(COUNTA(H495:AA495)=0,\"\",COUNTA(H495:AA495))","v":""},null,null,null,null,null,null,null,null,null,null,null,null,null,null,null,null,null,null,null,null,null,null,0,{"$f":"AB495-AB494","v":0}]
[null,null,null,null,null,null,null,null,null,null,null,null,null,null,null,null,null,null,null,null,null,null,null,null,null,null,null,0]
[50,null,null,null,{"$f":"IF(COUNTA(H497:AA497)=0,\"\",COUNTA(H497:AA497))","v":""},null,null,null,null,null,null,null,null,null,null,null,null,null,null,null,null,null,null,null,null,null,null,0,{"$f":"AB497-AB496","v":0}]
[null,null,null,null,null,null,null,null,null,null,null,null,null,null,null,null,null,null,null,null,null,null,null,null,null,null,null,0]
[50,null,null,null,{"$f":"IF(COUNTA(H499:AA499)=0,\"\",COUNTA(H499:AA499))","v":""},null,null,null,null,null,null,null,null,null,null,null,null,null,null,null,null,null,null,null,null,null,null,0,{"$f":"AB499-AB498","v":0}]
[null,null,null,null,null,null,null,null,null,null,null,null,null,null,null,null,null,null,null,null,null,null,null,null,null,null,null,0]
[50,null,null,null,{"$f":"IF(COUNTA(H501:AA501)=0,\"\",COUNTA(H501:AA501))","v":""},null,null,null,null,null,null,null,null,null,null,null,null,null,null,null,null,null,null,null,null,null,null,0,{"$f":"AB501-AB500","v":0}]
[null,null,null,null,null,null,null,null,null,null,null,null,null,null,null,null,null,null,null,null,null,null,null,null,null,null,null,0]
[50,"学",null,null,{"$f":"IF(COUNTA(H503:AA503)=0,\"\",COUNTA(H503:AA503))","v":""},null,null,null,null,null,null,null,null,null,null,null,null,null,null,null,null,null,null,null,null,null,null,0,{"$f":"AB503-AB502","v":0}]
[null,null,null,null,null,null,null,null,null,null,null,null,null,null,null,null,null,null,null,null,null,null,null,null,null,null,null,0]
[51,null,{"$f":"IF(G2338=\"\",\"\",G2338)","v":"t51"},null,{"$f":"IF(COUNTA(H505:AA505)=0,\"\",COUNTA(H505:AA505))","v":""},null,null,null,null,null,null,null,null,null,null,null,null,null,null,null,null,null,null,null,null,null,null,0,{"$f":"AB505-AB504","v":0}]
[null,null,null,null,null,null,null,null,null,null,null,null,null,null,null,null,null,null,null,null,null,null,null,null,null,null,null,0]
[51,null,null,null,{"$f":"IF(COUNTA(H507:AA507)=0,\"\",COUNTA(H507:AA507))","v":""},null,null,null,null,null,null,null,null,null,null,null,null,null,null,null,null,null,null,null,null,null,null,0,{"$f":"AB507-AB506","v":0}]
[null,null,null,null,null,null,null,null,null,null,null,null,null,null,null,null,null,null,null,null,null,null,null,null,null,null,null,0]
[51,null,null,null,{"$f":"IF(COUNTA(H509:AA509)=0,\"\",COUNTA(H509:AA509))","v":""},null,null,null,null,null,null,null,null,null,null,null,null,null,null,null,null,null,null,null,null,null,null,0,{"$f":"AB509-AB508","v":0}]
[null,null,null,null,null,null,null,null,null,null,null,null,null,null,null,null,null,null,null,null,null,null,null,null,null,null,null,0]
[51,null,null,null,{"$f":"IF(COUNTA(H511:AA511)=0,\"\",COUNTA(H511:AA511))","v":""},null,null,null,null,null,null,null,null,null,null,null,null,null,null,null,null,null,null,null,null,null,null,0,{"$f":"AB511-AB510","v":0}]
[null,null,null,null,null,null,null,null,null,null,null,null,null,null,null,null,null,null,null,null,null,null,null,null,null,null,null,0]
[51,null,null,null,{"$f":"IF(COUNTA(H513:AA513)=0,\"\",COUNTA(H513:AA513))","v":""},null,null,null,null,null,null,null,null,null,null,null,null,null,null,null,null,null,null,null,null,null,null,0,{"$f":"AB513-AB512","v":0}]
[null,null,null,null,null,null,null,null,null,null,null,null,null,null,null,null,null,null,null,null,null,null,null,null,null,null,null,0]
[52,null,{"$f":"IF(G2340=\"\",\"\",G2340)","v":"t52"},null,{"$f":"IF(COUNTA(H515:AA515)=0,\"\",COUNTA(H515:AA515))","v":""},null,null,null,null,null,null,null,null,null,null,null,null,null,null,null,null,null,null,null,null,null,null,0,{"$f":"AB515-AB514","v":0}]
[null,null,null,null,null,null,null,null,null,null,null,null,null,null,null,null,null,null,null,null,null,null,null,null,null,null,null,{"$f":"COUNTA(H516:AA516)","v":0}]
[52,null,null,null,{"$f":"IF(COUNTA(H517:AA517)=0,\"\",COUNTA(H517:AA517))","v":""},null,null,null,null,null,null,null,null,null,null,null,null,null,null,null,null,null,null,null,null,null,null,0,{"$f":"AB517-AB516","v":0}]
[null,null,null,null,null,null,null,null,null,null,null,null,null,null,null,null,null,null,null,null,null,null,null,null,null,null,null,0]
[52,null,null,null,{"$f":"IF(COUNTA(H519:AA519)=0,\"\",COUNTA(H519:AA519))","v":""},null,null,null,null,null,null,null,null,null,null,null,null,null,null,null,null,null,null,null,null,null,null,0,{"$f":"AB519-AB518","v":0}]
[null,null,null,null,null,null,null,null,null,null,null,null,null,null,null,null,null,null,null,null,null,null,null,null,null,null,null,0]
[52,null,null,null,{"$f":"IF(COUNTA(H521:AA521)=0,\"\",COUNTA(H521:AA521))","v":""},null,null,null,null,null,null,null,null,null,null,null,null,null,null,null,null,null,null,null,null,null,null,0,{"$f":"AB521-AB520","v":0}]
[null,null,null,null,null,null,null,null,null,null,null,null,null,null,null,null,null,null,null,null,null,null,null,null,null,null,null,0]
[52,null,null,null,{"$f":"IF(COUNTA(H523:AA523)=0,\"\",COUNTA(H523:AA523))","v":""},null,null,null,null,null,null,null,null,null,null,null,null,null,null,null,null,null,null,null,null,null,null,0,{"$f":"AB523-AB522","v":0}]
[null,null,null,null,null,null,null,null,null,null,null,null,null,null,null,null,null,null,null,null,null,null,null,null,null,null,null,0]
[53,null,{"$f":"IF(G2342=\"\",\"\",G2342)","v":"t53"},null,{"$f":"IF(COUNTA(H525:AA525)=0,\"\",COUNTA(H525:AA525))","v":""},null,null,null,null,null,null,null,null,null,null,null,null,null,null,null,null,null,null,null,null,null,null,0,{"$f":"AB525-AB524","v":0}]
[null,null,null,null,null,null,null,null,null,null,null,null,null,null,null,null,null,null,null,null,null,null,null,null,null,null,null,0]
[53,null,null,null,{"$f":"IF(COUNTA(H527:AA527)=0,\"\",COUNTA(H527:AA527))","v":""},null,null,null,null,null,null,null,null,null,null,null,null,null,null,null,null,null,null,null,null,null,null,0,{"$f":"AB527-AB526","v":0}]
[null,null,null,null,null,null,null,null,null,null,null,null,null,null,null,null,null,null,null,null,null,null,null,null,null,null,null,0]
[53,null,null,null,{"$f":"IF(COUNTA(H529:AA529)=0,\"\",COUNTA(H529:AA529))","v":""},null,null,null,null,null,null,null,null,null,null,null,null,null,null,null,null,null,null,null,null,null,null,0,{"$f":"AB529-AB528","v":0}]
[null,null,null,null,null,null,null,null,null,null,null,null,null,null,null,null,null,null,null,null,null,null,null,null,null,null,null,0]
[53,null,null,null,{"$f":"IF(COUNTA(H531:AA531)=0,\"\",COUNTA(H531:AA531))","v":""},null,null,null,null,null,null,null,null,null,null,null,null,null,null,null,null,null,null,null,null,null,null,0,{"$f":"AB531-AB530","v":0}]
[null,null,null,null,null,null,null,null,null,null,null,null,null,null,null,null,null,null,null,null,null,null,null,null,null,null,null,0]
[53,null,null,null,{"$f":"IF(COUNTA(H533:AA533)=0,\"\",COUNTA(H533:AA533))","v":""},null,null,null,null,null,null,null,null,null,null,null,null,null,null,null,null,null,null,null,null,null,null,0,{"$f":"AB533-AB532","v":0}]
[null,null,null,null,null,null,null,null,null,null,null,null,null,null,null,null,null,null,null,null,null,null,null,null,null,null,null,0]
[54,null,{"$f":"IF(G2344=\"\",\"\",G2344)","v":"t54"},null,{"$f":"IF(COUNTA(H535:AA535)=0,\"\",COUNTA(H535:AA535))","v":""},null,null,null,null,null,null,null,null,null,null,null,null,null,null,null,null,null,null,null,null,null,null,0,{"$f":"AB535-AB534","v":0}]
[null,null,null,null,null,null,null,null,null,null,null,null,null,null,null,null,null,null,null,null,null,null,null,null,null,null,null,0]
[54,null,null,null,{"$f":"IF(COUNTA(H537:AA537)=0,\"\",COUNTA(H537:AA537))","v":""},null,null,null,null,null,null,null,null,null,null,null,null,null,null,null,null,null,null,null,null,null,null,0,{"$f":"AB537-AB536","v":0}]
[null,null,null,null,null,null,null,null,null,null,null,null,null,null,null,null,null,null,null,null,null,null,null,null,null,null,null,0]
[54,null,null,null,{"$f":"IF(COUNTA(H539:AA539)=0,\"\",COUNTA(H539:AA539))","v":""},null,null,null,null,null,null,null,null,null,null,null,null,null,null,null,null,null,null,null,null,null,null,0,{"$f":"AB539-AB538","v":0}]
[null,null,null,null,null,null,null,null,null,null,null,null,null,null,null,null,null,null,null,null,null,null,null,null,null,null,null,0]
[54,null,null,null,{"$f":"IF(COUNTA(H541:AA541)=0,\"\",COUNTA(H541:AA541))","v":""},null,null,null,null,null,null,null,null,null,null,null,null,null,null,null,null,null,null,null,null,null,null,0,{"$f":"AB541-AB540","v":0}]
[null,null,null,null,null,null,null,null,null,null,null,null,null,null,null,null,null,null,null,null,null,null,null,null,null,null,null,0]
[54,null,null,null,{"$f":"IF(COUNTA(H543:AA543)=0,\"\",COUNTA(H543:AA543))","v":""},null,null,null,null,null,null,null,null,null,null,null,null,null,null,null,null,null,null,null,null,null,null,0,{"$f":"AB543-AB542","v":0}]
[null,null,null,null,null,null,null,null,null,null,null,null,null,null,null,null,null,null,null,null,null,null,null,null,null,null,null,0]
[55,null,{"$f":"G2346","v":"t55"},null,null,null,null,null,null,null,null,null,null,null,null,null,null,null,null,null,null,null,null,null,null,null,null,0,{"$f":"AB545-AB544","v":0}]
[null,null,null,null,null,null,null,null,null,null,null,null,null,null,null,null,null,null,null,null,null,null,null,null,null,null,null,0]
[55,null,null,null,null,null,null,null,null,null,null,null,null,null,null,null,null,null,null,null,null,null,null,null,null,null,null,0,{"$f":"AB547-AB546","v":0}]
[null,null,null,null,null,null,null,null,null,null,null,null,null,null,null,null,null,null,null,null,null,null,null,null,null,null,null,0]
[55,null,null,null,null,null,null,null,null,null,null,null,null,null,null,null,null,null,null,null,null,null,null,null,null,null,null,0,{"$f":"AB549-AB548","v":0}]
[null,null,null,null,null,null,null,null,null,null,null,null,null,null,null,null,null,null,null,null,null,null,null,null,null,null,null,0]
[55,null,null,null,null,null,null,null,null,null,null,null,null,null,null,null,null,null,null,null,null,null,null,null,null,null,null,0,{"$f":"AB551-AB550","v":0}]
[null,null,null,null,null,null,null,null,null,null,null,null,null,null,null,null,null,null,null,null,null,null,null,null,null,null,null,0]
[55,null,null,null,null,null,null,null,null,null,null,null,null,null,null,null,null,null,null,null,null,null,null,null,null,null,null,0,{"$f":"AB553-AB552","v":0}]
[null,null,null,null,null,null,null,null,null,null,null,null,null,null,null,null,null,null,null,null,null,null,null,null,null,null,null,0]
[56,null,{"$f":"G2348","v":"t56"},null,null,null,null,null,null,null,null,null,null,null,null,null,null,null,null,null,null,null,null,null,null,null,null,0,{"$f":"AB555-AB554","v":0}]
[null,null,null,null,null,null,null,null,null,null,null,null,null,null,null,null,null,null,null,null,null,null,null,null,null,null,null,0]
[56,null,null,null,null,null,null,null,null,null,null,null,null,null,null,null,null,null,null,null,null,null,null,null,null,null,null,0,{"$f":"AB557-AB556","v":0}]
[null,null,null,null,null,null,null,null,null,null,null,null,null,null,null,null,null,null,null,null,null,null,null,null,null,null,null,0]
[56,null,null,null,null,null,null,null,null,null,null,null,null,null,null,null,null,null,null,null,null,null,null,null,null,null,null,0,{"$f":"AB559-AB558","v":0}]
[null,null,null,null,null,null,null,null,null,null,null,null,null,null,null,null,null,null,null,null,null,null,null,null,null,null,null,0]
[56,null,null,null,null,null,null,null,null,null,null,null,null,null,null,null,null,null,null,null,null,null,null,null,null,null,null,0,{"$f":"AB561-AB560","v":0}]
[null,null,null,null,null,null,null,null,null,null,null,null,null,null,null,null,null,null,null,null,null,null,null,null,null,null,null,0]
[56,null,null,null,null,null,null,null,null,null,null,null,null,null,null,null,null,null,null,null,null,null,null,null,null,null,null,0,{"$f":"AB563-AB562","v":0}]
[null,null,null,null,null,null,null,null,null,null,null,null,null,null,null,null,null,null,null,null,null,null,null,null,null,null,null,0]
[57,null,{"$f":"G2350","v":"t57"},null,null,null,null,null,null,null,null,null,null,null,null,null,null,null,null,null,null,null,null,null,null,null,null,0,{"$f":"AB565-AB564","v":0}]
[null,null,null,null,null,null,null,null,null,null,null,null,null,null,null,null,null,null,null,null,null,null,null,null,null,null,null,0]
[57,null,null,null,null,null,null,null,null,null,null,null,null,null,null,null,null,null,null,null,null,null,null,null,null,null,null,0,{"$f":"AB567-AB566","v":0}]
[null,null,null,null,null,null,null,null,null,null,null,null,null,null,null,null,null,null,null,null,null,null,null,null,null,null,null,0]
[57,null,null,null,null,null,null,null,null,null,null,null,null,null,null,null,null,null,null,null,null,null,null,null,null,null,null,0,{"$f":"AB569-AB568","v":0}]
[null,null,null,null,null,null,null,null,null,null,null,null,null,null,null,null,null,null,null,null,null,null,null,null,null,null,null,0]
[57,null,null,null,null,null,null,null,null,null,null,null,null,null,null,null,null,null,null,null,null,null,null,null,null,null,null,0,{"$f":"AB571-AB570","v":0}]
[null,null,null,null,null,null,null,null,null,null,null,null,null,null,null,null,null,null,null,null,null,null,null,null,null,null,null,0]
[57,null,null,null,null,null,null,null,null,null,null,null,null,null,null,null,null,null,null,null,null,null,null,null,null,null,null,0,{"$f":"AB573-AB572","v":0}]
[null,null,null,null,null,null,null,null,null,null,null,null,null,null,null,null,null,null,null,null,null,null,null,null,null,null,null,0]
[58,null,{"$f":"G2352","v":"t58"},null,null,null,null,null,null,null,null,null,null,null,null,null,null,null,null,null,null,null,null,null,null,null,null,0,{"$f":"AB575-AB574","v":0}]
[null,null,null,null,null,null,null,null,null,null,null,null,null,null,null,null,null,null,null,null,null,null,null,null,null,null,null,0]
[58,null,null,null,null,null,null,null,null,null,null,null,null,null,null,null,null,null,null,null,null,null,null,null,null,null,null,0,{"$f":"AB577-AB576","v":0}]
[null,null,null,null,null,null,null,null,null,null,null,null,null,null,null,null,null,null,null,null,null,null,null,null,null,null,null,0]
[58,null,null,null,null,null,null,null,null,null,null,null,null,null,null,null,null,null,null,null,null,null,null,null,null,null,null,0,{"$f":"AB579-AB578","v":0}]
[null,null,null,null,null,null,null,null,null,null,null,null,null,null,null,null,null,null,null,null,null,null,null,null,null,null,null,{"$f":"COUNTA(H580:AA580)","v":0}]
[58,null,null,null,null,null,null,null,null,null,null,null,null,null,null,null,null,null,null,null,null,null,null,null,null,null,null,0,{"$f":"AB581-AB580","v":0}]
[null,null,null,null,null,null,null,null,null,null,null,null,null,null,null,null,null,null,null,null,null,null,null,null,null,null,null,0]
[58,null,null,null,null,null,null,null,null,null,null,null,null,null,null,null,null,null,null,null,null,null,null,null,null,null,null,0,{"$f":"AB583-AB582","v":0}]
[null,null,null,null,null,null,null,null,null,null,null,null,null,null,null,null,null,null,null,null,null,null,null,null,null,null,null,0]
[59,null,{"$f":"G2354","v":"t59"},null,null,null,null,null,null,null,null,null,null,null,null,null,null,null,null,null,null,null,null,null,null,null,null,0,{"$f":"AB585-AB584","v":0}]
[null,null,null,null,null,null,null,null,null,null,null,null,null,null,null,null,null,null,null,null,null,null,null,null,null,null,null,0]
[59,null,null,null,null,null,null,null,null,null,null,null,null,null,null,null,null,null,null,null,null,null,null,null,null,null,null,0,{"$f":"AB587-AB586","v":0}]
[null,null,null,null,null,null,null,null,null,null,null,null,null,null,null,null,null,null,null,null,null,null,null,null,null,null,null,0]
[59,null,null,null,null,null,null,null,null,null,null,null,null,null,null,null,null,null,null,null,null,null,null,null,null,null,null,0,{"$f":"AB589-AB588","v":0}]
[null,null,null,null,null,null,null,null,null,null,null,null,null,null,null,null,null,null,null,null,null,null,null,null,null,null,null,0]
[59,null,null,null,null,null,null,null,null,null,null,null,null,null,null,null,null,null,null,null,null,null,null,null,null,null,null,0,{"$f":"AB591-AB590","v":0}]
[null,null,null,null,null,null,null,null,null,null,null,null,null,null,null,null,null,null,null,null,null,null,null,null,null,null,null,0]
[59,null,null,null,null,null,null,null,null,null,null,null,null,null,null,null,null,null,null,null,null,null,null,null,null,null,null,0,{"$f":"AB593-AB592","v":0}]
[null,null,null,null,null,null,null,null,null,null,null,null,null,null,null,null,null,null,null,null,null,null,null,null,null,null,null,0]
[60,null,{"$f":"IF(G2356=\"\",\"\",G2356)","v":"t60"},null,{"$f":"IF(COUNTA(H595:AA595)=0,\"\",COUNTA(H595:AA595))","v":""},null,null,null,null,null,null,null,null,null,null,null,null,null,null,null,null,null,null,null,null,null,null,0,{"$f":"AB595-AB594","v":0}]
[null,null,{"$f":"IF(G2357=\"\",\"\",G2357)","v":""},null,null,null,null,null,null,null,null,null,null,null,null,null,null,null,null,null,null,null,null,null,null,null,null,0]
[60,null,null,null,{"$f":"IF(COUNTA(H597:AA597)=0,\"\",COUNTA(H597:AA597))","v":""},null,null,null,null,null,null,null,null,null,null,null,null,null,null,null,null,null,null,null,null,null,null,0,{"$f":"AB597-AB596","v":0}]
[null,null,null,null,null,null,null,null,null,null,null,null,null,null,null,null,null,null,null,null,null,null,null,null,null,null,null,0]
[60,null,null,null,{"$f":"IF(COUNTA(H599:AA599)=0,\"\",COUNTA(H599:AA599))","v":""},null,null,null,null,null,null,null,null,null,null,null,null,null,null,null,null,null,null,null,null,null,null,0,{"$f":"AB599-AB598","v":0}]
[null,null,null,null,null,null,null,null,null,null,null,null,null,null,null,null,null,null,null,null,null,null,null,null,null,null,null,0]
[60,null,null,null,{"$f":"IF(COUNTA(H601:AA601)=0,\"\",COUNTA(H601:AA601))","v":""},null,null,null,null,null,null,null,null,null,null,null,null,null,null,null,null,null,null,null,null,null,null,0,{"$f":"AB601-AB600","v":0}]
[null,null,null,null,null,null,null,null,null,null,null,null,null,null,null,null,null,null,null,null,null,null,null,null,null,null,null,0]
[60,null,null,null,{"$f":"IF(COUNTA(H603:AA603)=0,\"\",COUNTA(H603:AA603))","v":""},null,null,null,null,null,null,null,null,null,null,null,null,null,null,null,null,null,null,null,null,null,null,0,{"$f":"AB603-AB602","v":0}]
[null,null,null,null,null,null,null,16,22,32,51,12,43,23,53,54,42,33,25,null,null,null,null,null,null,null,null,12]
[61,null,{"$f":"IF(G2358=\"\",\"\",G2358)","v":"関"},4,{"$f":"IF(COUNTA(H605:AA605)=0,\"\",COUNTA(H605:AA605))","v":12},"化Ｂ","関","*11","*11","*11","*11","*12","*12","*12","*12","*13","*13","*13","*13",null,null,null,null,null,null,null,null,12,{"$f":"AB605-AB604","v":0}]
[null,null,null,null,null,null,null,null,null,null,null,null,null,null,null,null,null,null,null,null,null,null,null,null,null,null,null,0]
[61,null,null,null,{"$f":"IF(COUNTA(H607:AA607)=0,\"\",COUNTA(H607:AA607))","v":""},null,null,null,null,null,null,null,null,null,null,null,null,null,null,null,null,null,null,null,null,null,null,0,{"$f":"AB607-AB606","v":0}]
[null,null,null,null,null,null,null,null,null,null,null,null,null,null,null,null,null,null,null,null,null,null,null,null,null,null,null,0]
[61,null,null,null,{"$f":"IF(COUNTA(H609:AA609)=0,\"\",COUNTA(H609:AA609))","v":""},null,null,null,null,null,null,null,null,null,null,null,null,null,null,null,null,null,null,null,null,null,null,0,{"$f":"AB609-AB608","v":0}]
[null,null,null,null,null,null,null,null,null,null,null,null,null,null,null,null,null,null,null,null,null,null,null,null,null,null,null,0]
[61,null,null,null,{"$f":"IF(COUNTA(H611:AA611)=0,\"\",COUNTA(H611:AA611))","v":""},null,null,null,null,null,null,null,null,null,null,null,null,null,null,null,null,null,null,null,null,null,null,0,{"$f":"AB611-AB610","v":0}]
[null,null,null,null,null,null,null,46,null,null,null,null,null,null,null,null,null,null,null,null,null,null,null,null,null,null,null,1]
[61,null,null,null,{"$f":"IF(COUNTA(H613:AA613)=0,\"\",COUNTA(H613:AA613))","v":1},"LHR","関","*11",null,null,null,null,null,null,null,null,null,null,null,null,null,null,null,null,null,null,null,1,{"$f":"AB613-AB612","v":0}]
[null,null,null,null,null,null,null,32,41,55,36,45,16,31,53,25,null,null,null,null,null,null,null,null,null,null,null,9]
[62,null,{"$f":"IF(G2360=\"\",\"\",G2360)","v":"上村"},2,{"$f":"IF(COUNTA(H615:AA615)=0,\"\",COUNTA(H615:AA615))","v":10},"物Ｄ","上村","*21","*21","*22","*22","*23","*23","*24","*24","*25","*25",null,null,null,null,null,null,null,null,null,null,10,{"$f":"AB615-AB614","v":1}]
[null,null,null,null,null,null,null,21,null,11,null,35,null,null,null,null,null,null,null,null,null,null,null,null,null,null,null,3]
[62,null,null,2,{"$f":"IF(COUNTA(H617:AA617)=0,\"\",COUNTA(H617:AA617))","v":6},"地学","上村","*32","*32","*34","*34","*37","*37",null,null,null,null,null,null,null,null,null,null,null,null,null,null,6,{"$f":"AB617-AB616","v":3}]
[null,null,null,null,null,null,null,null,null,null,null,null,null,null,null,null,null,null,null,null,null,null,null,null,null,null,null,0]
[62,null,null,null,{"$f":"IF(COUNTA(H619:AA619)=0,\"\",COUNTA(H619:AA619))","v":""},null,null,null,null,null,null,null,null,null,null,null,null,null,null,null,null,null,null,null,null,null,null,0,{"$f":"AB619-AB618","v":0}]
[null,null,null,null,null,null,null,null,null,null,null,null,null,null,null,null,null,null,null,null,null,null,null,null,null,null,null,0]
[62,null,null,null,{"$f":"IF(COUNTA(H621:AA621)=0,\"\",COUNTA(H621:AA621))","v":""},null,null,null,null,null,null,null,null,null,null,null,null,null,null,null,null,null,null,null,null,null,null,0,{"$f":"AB621-AB620","v":0}]
[null,null,null,null,null,null,null,46,null,null,null,null,null,null,null,null,null,null,null,null,null,null,null,null,null,null,null,1]
[62," ",null,null,{"$f":"IF(COUNTA(H623:AA623)=0,\"\",COUNTA(H623:AA623))","v":1},"LHR","上村","*22",null,null,null,null,null,null,null,null,null,null,null,null,null,null,null,null,null,null,null,1,{"$f":"AB623-AB622","v":0}]
[null,null,null,null,null,null,null,44,33,22,13,55,45,32,62,null,null,null,null,null,null,null,null,null,null,null,null,8]
[63,"理",{"$f":"IF(G2362=\"\",\"\",G2362)","v":"中田"},4,{"$f":"IF(COUNTA(H625:AA625)=0,\"\",COUNTA(H625:AA625))","v":8},"化Ｂ","中田","*17","*17","*17","*17","*18","*18","*18","*18",null,null,null,null,null,null,null,null,null,null,null,null,8,{"$f":"AB625-AB624","v":0}]
[null,null,null,null,null,null,null,16,31,11,54,23,null,null,null,null,null,null,null,null,null,null,null,null,null,null,null,5]
[63,null,null,2,{"$f":"IF(COUNTA(H627:AA627)=0,\"\",COUNTA(H627:AA627))","v":6},"物Ｃ","中田","*26","*26","*27","*27","*28","*28",null,null,null,null,null,null,null,null,null,null,null,null,null,null,6,{"$f":"AB627-AB626","v":1}]
[null,null,null,null,null,null,null,null,null,null,null,null,null,null,null,null,null,null,null,null,null,null,null,null,null,null,null,0]
[63,null,null,null,{"$f":"IF(COUNTA(H629:AA629)=0,\"\",COUNTA(H629:AA629))","v":""},null,null,null,null,null,null,null,null,null,null,null,null,null,null,null,null,null,null,null,null,null,null,0,{"$f":"AB629-AB628","v":0}]
[null,null,null,null,null,null,null,null,null,null,null,null,null,null,null,null,null,null,null,null,null,null,null,null,null,null,null,0]
[63,null,null,null,{"$f":"IF(COUNTA(H631:AA631)=0,\"\",COUNTA(H631:AA631))","v":""},null,null,null,null,null,null,null,null,null,null,null,null,null,null,null,null,null,null,null,null,null,null,0,{"$f":"AB631-AB630","v":0}]
[null,null,null,null,null,null,null,46,null,null,null,null,null,null,null,null,null,null,null,null,null,null,null,null,null,null,null,1]
[63,null,null,null,{"$f":"IF(COUNTA(H633:AA633)=0,\"\",COUNTA(H633:AA633))","v":1},"LHR","中田","*26",null,null,null,null,null,null,null,null,null,null,null,null,null,null,null,null,null,null,null,1,{"$f":"AB633-AB632","v":0}]
[null,null,null,null,null,null,null,null,null,32,41,null,null,45,null,13,null,null,null,null,null,null,null,null,null,null,null,4]
[64,null,{"$f":"IF(G2364=\"\",\"\",G2364)","v":"金室"},2,{"$f":"IF(COUNTA(H635:AA635)=0,\"\",COUNTA(H635:AA635))","v":10},"物Ｃ","金室","*21","*21","*22","*22","*23","*23","*24","*24","*25","*25",null,null,null,null,null,null,null,null,null,null,10,{"$f":"AB635-AB634","v":6}]
[null,null,null,null,null,null,null,null,null,26,12,22,54,null,null,null,null,null,null,null,null,null,null,null,null,null,null,4]
[64,null,null,2,{"$f":"IF(COUNTA(H637:AA637)=0,\"\",COUNTA(H637:AA637))","v":6},"物Ｄ","金室","*26","*26","*27","*27","*28","*28",null,null,null,null,null,null,null,null,null,null,null,null,null,null,6,{"$f":"AB637-AB636","v":2}]
[null,null,null,null,null,null,null,null,null,null,null,null,null,null,null,null,null,null,null,null,null,null,null,null,null,null,null,0]
[64,null,null,null,{"$f":"IF(COUNTA(H639:AA639)=0,\"\",COUNTA(H639:AA639))","v":""},null,null,null,null,null,null,null,null,null,null,null,null,null,null,null,null,null,null,null,null,null,null,0,{"$f":"AB639-AB638","v":0}]
[null,null,null,null,null,null,null,null,null,null,null,null,null,null,null,null,null,null,null,null,null,null,null,null,null,null,null,0]
[64,null,null,null,{"$f":"IF(COUNTA(H641:AA641)=0,\"\",COUNTA(H641:AA641))","v":""},null,null,null,null,null,null,null,null,null,null,null,null,null,null,null,null,null,null,null,null,null,null,0,{"$f":"AB641-AB640","v":0}]
[null,null,null,null,null,null,null,null,null,null,null,null,null,null,null,null,null,null,null,null,null,null,null,null,null,null,null,0]
[64,null,null,null,{"$f":"IF(COUNTA(H643:AA643)=0,\"\",COUNTA(H643:AA643))","v":""},null,null,null,null,null,null,null,null,null,null,null,null,null,null,null,null,null,null,null,null,null,null,0,{"$f":"AB643-AB642","v":0}]
[null,null,null,null,null,null,null,23,12,41,35,15,51,62,31,13,42,33,53,36,26,55,16,null,null,null,null,{"$f":"COUNTA(H644:AA644)","v":16}]
[65,null,{"$f":"IF(G2366=\"\",\"\",G2366)","v":"成谷"},4,{"$f":"IF(COUNTA(H645:AA645)=0,\"\",COUNTA(H645:AA645))","v":16},"生物","成谷","*35","*35","*35","*35","*36","*36","*36","*36","*37","*37","*37","*37","*38","*38","*38","*38",null,null,null,null,16,{"$f":"AB645-AB644","v":0}]
[null,null,null,null,null,null,null,null,null,null,null,null,null,null,null,null,null,null,null,null,null,null,null,null,null,null,null,0]
[65,null,null,null,{"$f":"IF(COUNTA(H647:AA647)=0,\"\",COUNTA(H647:AA647))","v":""},null,null,null,null,null,null,null,null,null,null,null,null,null,null,null,null,null,null,null,null,null,null,0,{"$f":"AB647-AB646","v":0}]
[null,null,null,null,null,null,null,null,null,null,null,null,null,null,null,null,null,null,null,null,null,null,null,null,null,null,null,0]
[65,null,null,null,{"$f":"IF(COUNTA(H649:AA649)=0,\"\",COUNTA(H649:AA649))","v":""},null,null,null,null,null,null,null,null,null,null,null,null,null,null,null,null,null,null,null,null,null,null,0,{"$f":"AB649-AB648","v":0}]
[null,null,null,null,null,null,null,null,null,null,null,null,null,null,null,null,null,null,null,null,null,null,null,null,null,null,null,0]
[65,null,null,null,{"$f":"IF(COUNTA(H651:AA651)=0,\"\",COUNTA(H651:AA651))","v":""},null,null,null,null,null,null,null,null,null,null,null,null,null,null,null,null,null,null,null,null,null,null,0,{"$f":"AB651-AB650","v":0}]
[null,null,null,null,null,null,null,46,null,null,null,null,null,null,null,null,null,null,null,null,null,null,null,null,null,null,null,1]
[65," ",null,null,{"$f":"IF(COUNTA(H653:AA653)=0,\"\",COUNTA(H653:AA653))","v":1},"LHR","成谷","*38",null,null,null,null,null,null,null,null,null,null,null,null,null,null,null,null,null,null,null,1,{"$f":"AB653-AB652","v":0}]
[null,null,null,null,null,null,null,62,33,42,26,44,51,32,11,43,24,35,14,null,null,null,null,null,null,null,null,12]
[66,null,{"$f":"IF(G2368=\"\",\"\",G2368)","v":"斉藤ｻ"},4,{"$f":"IF(COUNTA(H655:AA655)=0,\"\",COUNTA(H655:AA655))","v":12},"化Ｂ","斉藤ｻ","*14","*14","*14","*14","*15","*15","*15","*15","*16","*16","*16","*16",null,null,null,null,null,null,null,null,12,{"$f":"AB655-AB654","v":0}]
[null,null,null,null,null,null,null,null,null,null,null,null,null,null,null,null,null,null,null,null,null,null,null,null,null,null,null,0]
[66," ",null,null,{"$f":"IF(COUNTA(H657:AA657)=0,\"\",COUNTA(H657:AA657))","v":""},null,null,null,null,null,null,null,null,null,null,null,null,null,null,null,null,null,null,null,null,null,null,0,{"$f":"AB657-AB656","v":0}]
[null,null,null,null,null,null,null,null,null,null,null,null,null,null,null,null,null,null,null,null,null,null,null,null,null,null,null,0]
[66,null,null,null,{"$f":"IF(COUNTA(H659:AA659)=0,\"\",COUNTA(H659:AA659))","v":""},null,null,null,null,null,null,null,null,null,null,null,null,null,null,null,null,null,null,null,null,null,null,0,{"$f":"AB659-AB658","v":0}]
[null,null,null,null,null,null,null,null,null,null,null,null,null,null,null,null,null,null,null,null,null,null,null,null,null,null,null,0]
[66," ",null,null,{"$f":"IF(COUNTA(H661:AA661)=0,\"\",COUNTA(H661:AA661))","v":""},null,null,null,null,null,null,null,null,null,null,null,null,null,null,null,null,null,null,null,null,null,null,0,{"$f":"AB661-AB660","v":0}]
[null,null,null,null,null,null,null,null,null,null,null,null,null,null,null,null,null,null,null,null,null,null,null,null,null,null,null,0]
[66,null,null,null,{"$f":"IF(COUNTA(H663:AA663)=0,\"\",COUNTA(H663:AA663))","v":""},null,null,null,null,null,null,null,null,null,null,null,null,null,null,null,null,null,null,null,null,null,null,0,{"$f":"AB663-AB662","v":0}]
[null,null,null,null,null,null,null,35,26,62,13,25,43,11,55,61,45,31,12,22,16,53,34,null,null,null,null,16]
[67,null,{"$f":"IF(G2370=\"\",\"\",G2370)","v":"涌井"},4,{"$f":"IF(COUNTA(H665:AA665)=0,\"\",COUNTA(H665:AA665))","v":16},"生物","涌井","*31","*31","*31","*31","*32","*32","*32","*32","*33","*33","*33","*33","*34","*34","*34","*34",null,null,null,null,16,{"$f":"AB665-AB664","v":0}]
[null,null,null,null,null,null,null,null,null,null,null,null,null,null,null,null,null,null,null,null,null,null,null,null,null,null,null,0]
[67,null,null,null,{"$f":"IF(COUNTA(H667:AA667)=0,\"\",COUNTA(H667:AA667))","v":""},null,null,null,null,null,null,null,null,null,null,null,null,null,null,null,null,null,null,null,null,null,null,0,{"$f":"AB667-AB666","v":0}]
[null,null,null,null,null,null,null,null,null,null,null,null,null,null,null,null,null,null,null,null,null,null,null,null,null,null,null,0]
[67,null,null,null,{"$f":"IF(COUNTA(H669:AA669)=0,\"\",COUNTA(H669:AA669))","v":""},null,null,null,null,null,null,null,null,null,null,null,null,null,null,null,null,null,null,null,null,null,null,0,{"$f":"AB669-AB668","v":0}]
[null,null,null,null,null,null,null,null,null,null,null,null,null,null,null,null,null,null,null,null,null,null,null,null,null,null,null,0]
[67,null,null,null,{"$f":"IF(COUNTA(H671:AA671)=0,\"\",COUNTA(H671:AA671))","v":""},null,null,null,null,null,null,null,null,null,null,null,null,null,null,null,null,null,null,null,null,null,null,0,{"$f":"AB671-AB670","v":0}]
[null,null,null,null,null,null,null,null,null,null,null,null,null,null,null,null,null,null,null,null,null,null,null,null,null,null,null,0]
[67,null,null,null,{"$f":"IF(COUNTA(H673:AA673)=0,\"\",COUNTA(H673:AA673))","v":""},null,null,null,null,null,null,null,null,null,null,null,null,null,null,null,null,null,null,null,null,null,null,0,{"$f":"AB673-AB672","v":0}]
[null,null,null,null,null,null,null,null,null,null,null,null,null,null,null,null,null,null,null,null,null,null,null,null,null,null,null,0]
[68,null,{"$f":"IF(G2372=\"\",\"\",G2372)","v":"t68"},null,{"$f":"IF(COUNTA(H675:AA675)=0,\"\",COUNTA(H675:AA675))","v":""},null,null,null,null,null,null,null,null,null,null,null,null,null,null,null,null,null,null,null,null,null,null,0,{"$f":"AB675-AB674","v":0}]
[null,null,null,null,null,null,null,null,null,null,null,null,null,null,null,null,null,null,null,null,null,null,null,null,null,null,null,0]
[68,null,null,null,{"$f":"IF(COUNTA(H677:AA677)=0,\"\",COUNTA(H677:AA677))","v":""},null,null,null,null,null,null,null,null,null,null,null,null,null,null,null,null,null,null,null,null,null,null,0,{"$f":"AB677-AB676","v":0}]
[null,null,null,null,null,null,null,null,null,null,null,null,null,null,null,null,null,null,null,null,null,null,null,null,null,null,null,0]
[68,null,null,null,{"$f":"IF(COUNTA(H679:AA679)=0,\"\",COUNTA(H679:AA679))","v":""},null,null,null,null,null,null,null,null,null,null,null,null,null,null,null,null,null,null,null,null,null,null,0,{"$f":"AB679-AB678","v":0}]
[null,null,null,null,null,null,null,null,null,null,null,null,null,null,null,null,null,null,null,null,null,null,null,null,null,null,null,0]
[68,null,null,null,{"$f":"IF(COUNTA(H681:AA681)=0,\"\",COUNTA(H681:AA681))","v":""},null,null,null,null,null,null,null,null,null,null,null,null,null,null,null,null,null,null,null,null,null,null,0,{"$f":"AB681-AB680","v":0}]
[null,null,null,null,null,null,null,null,null,null,null,null,null,null,null,null,null,null,null,null,null,null,null,null,null,null,null,0]
[68,null,null,null,{"$f":"IF(COUNTA(H683:AA683)=0,\"\",COUNTA(H683:AA683))","v":""},null,null,null,null,null,null,null,null,null,null,null,null,null,null,null,null,null,null,null,null,null,null,0,{"$f":"AB683-AB682","v":0}]
[null,null,null,null,null,null,null,null,null,null,null,null,null,null,null,null,null,null,null,null,null,null,null,null,null,null,null,0]
[69,null,{"$f":"IF(G2374=\"\",\"\",G2374)","v":"t69"},null,{"$f":"IF(COUNTA(H685:AA685)=0,\"\",COUNTA(H685:AA685))","v":""},null,null,null,null,null,null,null,null,null,null,null,null,null,null,null,null,null,null,null,null,null,null,0,{"$f":"AB685-AB684","v":0}]
[null,null,null,null,null,null,null,null,null,null,null,null,null,null,null,null,null,null,null,null,null,null,null,null,null,null,null,0]
[69,null,null,null,{"$f":"IF(COUNTA(H687:AA687)=0,\"\",COUNTA(H687:AA687))","v":""},null,null,null,null,null,null,null,null,null,null,null,null,null,null,null,null,null,null,null,null,null,null,0,{"$f":"AB687-AB686","v":0}]
[null,null,null,null,null,null,null,null,null,null,null,null,null,null,null,null,null,null,null,null,null,null,null,null,null,null,null,0]
[69,null,null,null,{"$f":"IF(COUNTA(H689:AA689)=0,\"\",COUNTA(H689:AA689))","v":""},null,null,null,null,null,null,null,null,null,null,null,null,null,null,null,null,null,null,null,null,null,null,0,{"$f":"AB689-AB688","v":0}]
[null,null,null,null,null,null,null,null,null,null,null,null,null,null,null,null,null,null,null,null,null,null,null,null,null,null,null,0]
[69,null,null,null,{"$f":"IF(COUNTA(H691:AA691)=0,\"\",COUNTA(H691:AA691))","v":""},null,null,null,null,null,null,null,null,null,null,null,null,null,null,null,null,null,null,null,null,null,null,0,{"$f":"AB691-AB690","v":0}]
[null,null,null,null,null,null,null,null,null,null,null,null,null,null,null,null,null,null,null,null,null,null,null,null,null,null,null,0]
[69,null,null,null,{"$f":"IF(COUNTA(H693:AA693)=0,\"\",COUNTA(H693:AA693))","v":""},null,null,null,null,null,null,null,null,null,null,null,null,null,null,null,null,null,null,null,null,null,null,0,{"$f":"AB693-AB692","v":0}]
[null,null,null,null,null,null,null,null,null,null,null,null,null,null,null,null,null,null,null,null,null,null,null,null,null,null,null,0]
[70,null,{"$f":"IF(G2376=\"\",\"\",G2376)","v":"t70"},null,{"$f":"IF(COUNTA(H695:AA695)=0,\"\",COUNTA(H695:AA695))","v":""},null,null,null,null,null,null,null,null,null,null,null,null,null,null,null,null,null,null,null,null,null,null,0,{"$f":"AB695-AB694","v":0}]
[null,null,null,null,null,null,null,null,null,null,null,null,null,null,null,null,null,null,null,null,null,null,null,null,null,null,null,0]
[70,null,null,null,{"$f":"IF(COUNTA(H697:AA697)=0,\"\",COUNTA(H697:AA697))","v":""},null,null,null,null,null,null,null,null,null,null,null,null,null,null,null,null,null,null,null,null,null,null,0,{"$f":"AB697-AB696","v":0}]
[null,null,null,null,null,null,null,null,null,null,null,null,null,null,null,null,null,null,null,null,null,null,null,null,null,null,null,0]
[70,null,null,null,{"$f":"IF(COUNTA(H699:AA699)=0,\"\",COUNTA(H699:AA699))","v":""},null,null,null,null,null,null,null,null,null,null,null,null,null,null,null,null,null,null,null,null,null,null,0,{"$f":"AB699-AB698","v":0}]
[null,null,null,null,null,null,null,null,null,null,null,null,null,null,null,null,null,null,null,null,null,null,null,null,null,null,null,0]
[70,null,null,null,{"$f":"IF(COUNTA(H701:AA701)=0,\"\",COUNTA(H701:AA701))","v":""},null,null,null,null,null,null,null,null,null,null,null,null,null,null,null,null,null,null,null,null,null,null,0,{"$f":"AB701-AB700","v":0}]
[null,null,null,null,null,null,null,null,null,null,null,null,null,null,null,null,null,null,null,null,null,null,null,null,null,null,null,0]
[70,"科",null,null,{"$f":"IF(COUNTA(H703:AA703)=0,\"\",COUNTA(H703:AA703))","v":""},null,null,null,null,null,null,null,null,null,null,null,null,null,null,null,null,null,null,null,null,null,null,0,{"$f":"AB703-AB702","v":0}]
[null,null,null,null,null,null,null,null,null,null,null,null,null,null,null,null,null,null,null,null,null,null,null,null,null,null,null,0]
[71,null,{"$f":"IF(G2378=\"\",\"\",G2378)","v":"t71"},null,{"$f":"IF(COUNTA(H705:AA705)=0,\"\",COUNTA(H705:AA705))","v":""},null,null,null,null,null,null,null,null,null,null,null,null,null,null,null,null,null,null,null,null,null,null,0,{"$f":"AB705-AB704","v":0}]
[null,null,null,null,null,null,null,null,null,null,null,null,null,null,null,null,null,null,null,null,null,null,null,null,null,null,null,0]
[71,null,null,null,{"$f":"IF(COUNTA(H707:AA707)=0,\"\",COUNTA(H707:AA707))","v":""},null,null,null,null,null,null,null,null,null,null,null,null,null,null,null,null,null,null,null,null,null,null,0,{"$f":"AB707-AB706","v":0}]
[null,null,null,null,null,null,null,null,null,null,null,null,null,null,null,null,null,null,null,null,null,null,null,null,null,null,null,{"$f":"COUNTA(H708:AA708)","v":0}]
[71,null,null,null,{"$f":"IF(COUNTA(H709:AA709)=0,\"\",COUNTA(H709:AA709))","v":""},null,null,null,null,null,null,null,null,null,null,null,null,null,null,null,null,null,null,null,null,null,null,0,{"$f":"AB709-AB708","v":0}]
[null,null,null,null,null,null,null,null,null,null,null,null,null,null,null,null,null,null,null,null,null,null,null,null,null,null,null,0]
[71,null,null,null,{"$f":"IF(COUNTA(H711:AA711)=0,\"\",COUNTA(H711:AA711))","v":""},null,null,null,null,null,null,null,null,null,null,null,null,null,null,null,null,null,null,null,null,null,null,0,{"$f":"AB711-AB710","v":0}]
[null,null,null,null,null,null,null,null,null,null,null,null,null,null,null,null,null,null,null,null,null,null,null,null,null,null,null,0]
[71,null,null,null,{"$f":"IF(COUNTA(H713:AA713)=0,\"\",COUNTA(H713:AA713))","v":""},null,null,null,null,null,null,null,null,null,null,null,null,null,null,null,null,null,null,null,null,null,null,0,{"$f":"AB713-AB712","v":0}]
[null,null,null,null,null,null,null,null,null,null,null,null,null,null,null,null,null,null,null,null,null,null,null,null,null,null,null,0]
[72,null,{"$f":"IF(G2380=\"\",\"\",G2380)","v":"t72"},null,{"$f":"IF(COUNTA(H715:AA715)=0,\"\",COUNTA(H715:AA715))","v":""},null,null,null,null,null,null,null,null,null,null,null,null,null,null,null,null,null,null,null,null,null,null,0,{"$f":"AB715-AB714","v":0}]
[null,null,null,null,null,null,null,null,null,null,null,null,null,null,null,null,null,null,null,null,null,null,null,null,null,null,null,0]
[72,null,null,null,{"$f":"IF(COUNTA(H717:AA717)=0,\"\",COUNTA(H717:AA717))","v":""},null,null,null,null,null,null,null,null,null,null,null,null,null,null,null,null,null,null,null,null,null,null,0,{"$f":"AB717-AB716","v":0}]
[null,null,null,null,null,null,null,null,null,null,null,null,null,null,null,null,null,null,null,null,null,null,null,null,null,null,null,0]
[72,null,null,null,{"$f":"IF(COUNTA(H719:AA719)=0,\"\",COUNTA(H719:AA719))","v":""},null,null,null,null,null,null,null,null,null,null,null,null,null,null,null,null,null,null,null,null,null,null,0,{"$f":"AB719-AB718","v":0}]
[null,null,null,null,null,null,null,null,null,null,null,null,null,null,null,null,null,null,null,null,null,null,null,null,null,null,null,0]
[72,null,null,null,{"$f":"IF(COUNTA(H721:AA721)=0,\"\",COUNTA(H721:AA721))","v":""},null,null,null,null,null,null,null,null,null,null,null,null,null,null,null,null,null,null,null,null,null,null,0,{"$f":"AB721-AB720","v":0}]
[null,null,null,null,null,null,null,null,null,null,null,null,null,null,null,null,null,null,null,null,null,null,null,null,null,null,null,0]
[72,null,null,null,{"$f":"IF(COUNTA(H723:AA723)=0,\"\",COUNTA(H723:AA723))","v":""},null,null,null,null,null,null,null,null,null,null,null,null,null,null,null,null,null,null,null,null,null,null,0,{"$f":"AB723-AB722","v":0}]
[null,null,null,null,null,null,null,null,null,null,null,null,null,null,null,null,null,null,null,null,null,null,null,null,null,null,null,0]
[73,null,{"$f":"IF(G2382=\"\",\"\",G2382)","v":"t73"},null,{"$f":"IF(COUNTA(H725:AA725)=0,\"\",COUNTA(H725:AA725))","v":""},null,null,null,null,null,null,null,null,null,null,null,null,null,null,null,null,null,null,null,null,null,null,0,{"$f":"AB725-AB724","v":0}]
[null,null,null,null,null,null,null,null,null,null,null,null,null,null,null,null,null,null,null,null,null,null,null,null,null,null,null,0]
[73,null,null,null,{"$f":"IF(COUNTA(H727:AA727)=0,\"\",COUNTA(H727:AA727))","v":""},null,null,null,null,null,null,null,null,null,null,null,null,null,null,null,null,null,null,null,null,null,null,0,{"$f":"AB727-AB726","v":0}]
[null,null,null,null,null,null,null,null,null,null,null,null,null,null,null,null,null,null,null,null,null,null,null,null,null,null,null,0]
[73,null,null,null,{"$f":"IF(COUNTA(H729:AA729)=0,\"\",COUNTA(H729:AA729))","v":""},null,null,null,null,null,null,null,null,null,null,null,null,null,null,null,null,null,null,null,null,null,null,0,{"$f":"AB729-AB728","v":0}]
[null,null,null,null,null,null,null,null,null,null,null,null,null,null,null,null,null,null,null,null,null,null,null,null,null,null,null,0]
[73,null,null,null,{"$f":"IF(COUNTA(H731:AA731)=0,\"\",COUNTA(H731:AA731))","v":""},null,null,null,null,null,null,null,null,null,null,null,null,null,null,null,null,null,null,null,null,null,null,0,{"$f":"AB731-AB730","v":0}]
[null,null,null,null,null,null,null,null,null,null,null,null,null,null,null,null,null,null,null,null,null,null,null,null,null,null,null,0]
[73,null,null,null,{"$f":"IF(COUNTA(H733:AA733)=0,\"\",COUNTA(H733:AA733))","v":""},null,null,null,null,null,null,null,null,null,null,null,null,null,null,null,null,null,null,null,null,null,null,0,{"$f":"AB733-AB732","v":0}]
[null,null,null,null,null,null,null,null,null,null,null,null,null,null,null,null,null,null,null,null,null,null,null,null,null,null,null,0]
[74,null,{"$f":"IF(G2384=\"\",\"\",G2384)","v":"t74"},null,{"$f":"IF(COUNTA(H735:AA735)=0,\"\",COUNTA(H735:AA735))","v":""},null,null,null,null,null,null,null,null,null,null,null,null,null,null,null,null,null,null,null,null,null,null,0,{"$f":"AB735-AB734","v":0}]
[null,null,null,null,null,null,null,null,null,null,null,null,null,null,null,null,null,null,null,null,null,null,null,null,null,null,null,0]
[74,null,null,null,{"$f":"IF(COUNTA(H737:AA737)=0,\"\",COUNTA(H737:AA737))","v":""},null,null,null,null,null,null,null,null,null,null,null,null,null,null,null,null,null,null,null,null,null,null,0,{"$f":"AB737-AB736","v":0}]
[null,null,null,null,null,null,null,null,null,null,null,null,null,null,null,null,null,null,null,null,null,null,null,null,null,null,null,0]
[74,null,null,null,{"$f":"IF(COUNTA(H739:AA739)=0,\"\",COUNTA(H739:AA739))","v":""},null,null,null,null,null,null,null,null,null,null,null,null,null,null,null,null,null,null,null,null,null,null,0,{"$f":"AB739-AB738","v":0}]
[null,null,null,null,null,null,null,null,null,null,null,null,null,null,null,null,null,null,null,null,null,null,null,null,null,null,null,0]
[74,null,null,null,{"$f":"IF(COUNTA(H741:AA741)=0,\"\",COUNTA(H741:AA741))","v":""},null,null,null,null,null,null,null,null,null,null,null,null,null,null,null,null,null,null,null,null,null,null,0,{"$f":"AB741-AB740","v":0}]
[null,null,null,null,null,null,null,null,null,null,null,null,null,null,null,null,null,null,null,null,null,null,null,null,null,null,null,0]
[74,null,null,null,{"$f":"IF(COUNTA(H743:AA743)=0,\"\",COUNTA(H743:AA743))","v":""},null,null,null,null,null,null,null,null,null,null,null,null,null,null,null,null,null,null,null,null,null,null,0,{"$f":"AB743-AB742","v":0}]
[null,null,{"$f":"G2386","v":"t75"},null,null,null,null,null,null,null,null,null,null,null,null,null,null,null,null,null,null,null,null,null,null,null,null,0]
[75,null,null,null,null,null,null,null,null,null,null,null,null,null,null,null,null,null,null,null,null,null,null,null,null,null,null,0,{"$f":"AB745-AB744","v":0}]
[null,null,null,null,null,null,null,null,null,null,null,null,null,null,null,null,null,null,null,null,null,null,null,null,null,null,null,0]
[75,null,null,null,null,null,null,null,null,null,null,null,null,null,null,null,null,null,null,null,null,null,null,null,null,null,null,0,{"$f":"AB747-AB746","v":0}]
[null,null,null,null,null,null,null,null,null,null,null,null,null,null,null,null,null,null,null,null,null,null,null,null,null,null,null,0]
[75,null,null,null,null,null,null,null,null,null,null,null,null,null,null,null,null,null,null,null,null,null,null,null,null,null,null,0,{"$f":"AB749-AB748","v":0}]
[null,null,null,null,null,null,null,null,null,null,null,null,null,null,null,null,null,null,null,null,null,null,null,null,null,null,null,0]
[75,null,null,null,null,null,null,null,null,null,null,null,null,null,null,null,null,null,null,null,null,null,null,null,null,null,null,0,{"$f":"AB751-AB750","v":0}]
[null,null,null,null,null,null,null,null,null,null,null,null,null,null,null,null,null,null,null,null,null,null,null,null,null,null,null,0]
[75,null,null,null,null,null,null,null,null,null,null,null,null,null,null,null,null,null,null,null,null,null,null,null,null,null,null,0,{"$f":"AB753-AB752","v":0}]
[null,null,null,null,null,null,null,null,null,null,null,null,null,null,null,null,null,null,null,null,null,null,null,null,null,null,null,0]
[76,null,{"$f":"G2388","v":"t76"},null,null,null,null,null,null,null,null,null,null,null,null,null,null,null,null,null,null,null,null,null,null,null,null,0,{"$f":"AB755-AB754","v":0}]
[null,null,null,null,null,null,null,null,null,null,null,null,null,null,null,null,null,null,null,null,null,null,null,null,null,null,null,0]
[76,null,null,null,null,null,null,null,null,null,null,null,null,null,null,null,null,null,null,null,null,null,null,null,null,null,null,0,{"$f":"AB757-AB756","v":0}]
[null,null,null,null,null,null,null,null,null,null,null,null,null,null,null,null,null,null,null,null,null,null,null,null,null,null,null,0]
[76,null,null,null,null,null,null,null,null,null,null,null,null,null,null,null,null,null,null,null,null,null,null,null,null,null,null,0,{"$f":"AB759-AB758","v":0}]
[null,null,null,null,null,null,null,null,null,null,null,null,null,null,null,null,null,null,null,null,null,null,null,null,null,null,null,0]
[76,null,null,null,null,null,null,null,null,null,null,null,null,null,null,null,null,null,null,null,null,null,null,null,null,null,null,0,{"$f":"AB761-AB760","v":0}]
[null,null,null,null,null,null,null,null,null,null,null,null,null,null,null,null,null,null,null,null,null,null,null,null,null,null,null,0]
[76,null,null,null,null,null,null,null,null,null,null,null,null,null,null,null,null,null,null,null,null,null,null,null,null,null,null,0,{"$f":"AB763-AB762","v":0}]
[null,null,null,null,null,null,null,null,null,null,null,null,null,null,null,null,null,null,null,null,null,null,null,null,null,null,null,0]
[77,null,{"$f":"G2390","v":"t77"},null,null,null,null,null,null,null,null,null,null,null,null,null,null,null,null,null,null,null,null,null,null,null,null,0,{"$f":"AB765-AB764","v":0}]
[null,null,null,null,null,null,null,null,null,null,null,null,null,null,null,null,null,null,null,null,null,null,null,null,null,null,null,0]
[77,null,null,null,null,null,null,null,null,null,null,null,null,null,null,null,null,null,null,null,null,null,null,null,null,null,null,0,{"$f":"AB767-AB766","v":0}]
[null,null,null,null,null,null,null,null,null,null,null,null,null,null,null,null,null,null,null,null,null,null,null,null,null,null,null,0]
[77,null,null,null,null,null,null,null,null,null,null,null,null,null,null,null,null,null,null,null,null,null,null,null,null,null,null,0,{"$f":"AB769-AB768","v":0}]
[null,null,null,null,null,null,null,null,null,null,null,null,null,null,null,null,null,null,null,null,null,null,null,null,null,null,null,0]
[77,null,null,null,null,null,null,null,null,null,null,null,null,null,null,null,null,null,null,null,null,null,null,null,null,null,null,0,{"$f":"AB771-AB770","v":0}]
[null,null,null,null,null,null,null,null,null,null,null,null,null,null,null,null,null,null,null,null,null,null,null,null,null,null,null,{"$f":"COUNTA(H772:AA772)","v":0}]
[77,null,null,null,null,null,null,null,null,null,null,null,null,null,null,null,null,null,null,null,null,null,null,null,null,null,null,0,{"$f":"AB773-AB772","v":0}]
[null,null,null,null,null,null,null,null,null,null,null,null,null,null,null,null,null,null,null,null,null,null,null,null,null,null,null,0]
[78,null,{"$f":"G2392","v":"t78"},null,null,null,null,null,null,null,null,null,null,null,null,null,null,null,null,null,null,null,null,null,null,null,null,0,{"$f":"AB775-AB774","v":0}]
[null,null,null,null,null,null,null,null,null,null,null,null,null,null,null,null,null,null,null,null,null,null,null,null,null,null,null,0]
[78,null,null,null,null,null,null,null,null,null,null,null,null,null,null,null,null,null,null,null,null,null,null,null,null,null,null,0,{"$f":"AB777-AB776","v":0}]
[null,null,null,null,null,null,null,null,null,null,null,null,null,null,null,null,null,null,null,null,null,null,null,null,null,null,null,0]
[78,null,null,null,null,null,null,null,null,null,null,null,null,null,null,null,null,null,null,null,null,null,null,null,null,null,null,0,{"$f":"AB779-AB778","v":0}]
[null,null,null,null,null,null,null,null,null,null,null,null,null,null,null,null,null,null,null,null,null,null,null,null,null,null,null,0]
[78,null,null,null,null,null,null,null,null,null,null,null,null,null,null,null,null,null,null,null,null,null,null,null,null,null,null,0,{"$f":"AB781-AB780","v":0}]
[null,null,null,null,null,null,null,null,null,null,null,null,null,null,null,null,null,null,null,null,null,null,null,null,null,null,null,0]
[78,null,null,null,null,null,null,null,null,null,null,null,null,null,null,null,null,null,null,null,null,null,null,null,null,null,null,0,{"$f":"AB783-AB782","v":0}]
[null,null,null,null,null,null,null,null,null,null,null,null,null,null,null,null,null,null,null,null,null,null,null,null,null,null,null,0]
[79,null,{"$f":"G2394","v":"t79"},null,null,null,null,null,null,null,null,null,null,null,null,null,null,null,null,null,null,null,null,null,null,null,null,0,{"$f":"AB785-AB784","v":0}]
[null,null,null,null,null,null,null,null,null,null,null,null,null,null,null,null,null,null,null,null,null,null,null,null,null,null,null,0]
[79,null,null,null,null,null,null,null,null,null,null,null,null,null,null,null,null,null,null,null,null,null,null,null,null,null,null,0,{"$f":"AB787-AB786","v":0}]
[null,null,null,null,null,null,null,null,null,null,null,null,null,null,null,null,null,null,null,null,null,null,null,null,null,null,null,0]
[79,null,null,null,null,null,null,null,null,null,null,null,null,null,null,null,null,null,null,null,null,null,null,null,null,null,null,0,{"$f":"AB789-AB788","v":0}]
[null,null,null,null,null,null,null,null,null,null,null,null,null,null,null,null,null,null,null,null,null,null,null,null,null,null,null,0]
[79,null,null,null,null,null,null,null,null,null,null,null,null,null,null,null,null,null,null,null,null,null,null,null,null,null,null,0,{"$f":"AB791-AB790","v":0}]
[null,null,null,null,null,null,null,null,null,null,null,null,null,null,null,null,null,null,null,null,null,null,null,null,null,null,null,0]
[79,null,null,null,null,null,null,null,null,null,null,null,null,null,null,null,null,null,null,null,null,null,null,null,null,null,null,0,{"$f":"AB793-AB792","v":0}]
[null,null,null,null,null,null,null,null,null,null,null,null,null,null,null,null,null,null,null,null,null,null,null,null,null,null,null,0]
[80,null,{"$f":"IF(G2396=\"\",\"\",G2396)","v":"t80"},null,{"$f":"IF(COUNTA(H795:AA795)=0,\"\",COUNTA(H795:AA795))","v":""},null,null,null,null,null,null,null,null,null,null,null,null,null,null,null,null,null,null,null,null,null,null,0,{"$f":"AB795-AB794","v":0}]
[null,null,null,null,null,null,null,null,null,null,null,null,null,null,null,null,null,null,null,null,null,null,null,null,null,null,null,0]
[80,null,null,null,{"$f":"IF(COUNTA(H797:AA797)=0,\"\",COUNTA(H797:AA797))","v":""},null,null,null,null,null,null,null,null,null,null,null,null,null,null,null,null,null,null,null,null,null,null,0,{"$f":"AB797-AB796","v":0}]
[null,null,null,null,null,null,null,null,null,null,null,null,null,null,null,null,null,null,null,null,null,null,null,null,null,null,null,0]
[80,null,null,null,{"$f":"IF(COUNTA(H799:AA799)=0,\"\",COUNTA(H799:AA799))","v":""},null,null,null,null,null,null,null,null,null,null,null,null,null,null,null,null,null,null,null,null,null,null,0,{"$f":"AB799-AB798","v":0}]
[null,null,null,null,null,null,null,null,null,null,null,null,null,null,null,null,null,null,null,null,null,null,null,null,null,null,null,0]
[80,null,null,null,{"$f":"IF(COUNTA(H801:AA801)=0,\"\",COUNTA(H801:AA801))","v":""},null,null,null,null,null,null,null,null,null,null,null,null,null,null,null,null,null,null,null,null,null,null,0,{"$f":"AB801-AB800","v":0}]
[null,null,null,null,null,null,null,null,null,null,null,null,null,null,null,null,null,null,null,null,null,null,null,null,null,null,null,0]
[80,null,null,null,{"$f":"IF(COUNTA(H803:AA803)=0,\"\",COUNTA(H803:AA803))","v":""},null,null,null,null,null,null,null,null,null,null,null,null,null,null,null,null,null,null,null,null,null,null,0,{"$f":"AB803-AB802","v":0}]
[null,null,null,null,null,null,null,null,null,null,null,null,null,null,null,null,null,null,null,null,null,null,null,null,null,null,null,0]
[81,null,{"$f":"IF(G2398=\"\",\"\",G2398)","v":"名児耶"},null,{"$f":"IF(COUNTA(H805:AA805)=0,\"\",COUNTA(H805:AA805))","v":""},null,null,null,null,null,null,null,null,null,null,null,null,null,null,null,null,null,null,null,null,null,null,0,{"$f":"AB805-AB804","v":0}]
[null,null,null,null,null,null,null,null,null,null,null,null,null,null,null,null,null,null,null,null,null,null,null,null,null,null,null,0]
[81,null,null,null,{"$f":"IF(COUNTA(H807:AA807)=0,\"\",COUNTA(H807:AA807))","v":""},null,null,null,null,null,null,null,null,null,null,null,null,null,null,null,null,null,null,null,null,null,null,0,{"$f":"AB807-AB806","v":0}]
[null,null,null,null,null,null,null,null,null,null,null,null,null,null,null,null,null,null,null,null,null,null,null,null,null,null,null,0]
[81,null,null,null,{"$f":"IF(COUNTA(H809:AA809)=0,\"\",COUNTA(H809:AA809))","v":""},null,null,null,null,null,null,null,null,null,null,null,null,null,null,null,null,null,null,null,null,null,null,0,{"$f":"AB809-AB808","v":0}]
[null,null,null,null,null,null,null,null,null,null,null,null,null,null,null,null,null,null,null,null,null,null,null,null,null,null,null,0]
[81,null,null,null,{"$f":"IF(COUNTA(H811:AA811)=0,\"\",COUNTA(H811:AA811))","v":""},null,null,null,null,null,null,null,null,null,null,null,null,null,null,null,null,null,null,null,null,null,null,0,{"$f":"AB811-AB810","v":0}]
[null,null,null,null,null,null,null,null,null,null,null,null,null,null,null,null,null,null,null,null,null,null,null,null,null,null,null,0]
[81,null,null,null,{"$f":"IF(COUNTA(H813:AA813)=0,\"\",COUNTA(H813:AA813))","v":""},null,null,null,null,null,null,null,null,null,null,null,null,null,null,null,null,null,null,null,null,null,null,0,{"$f":"AB813-AB812","v":0}]
[null,null,null,null,null,null,null,null,null,null,null,null,null,null,null,null,null,null,null,null,null,null,null,null,null,null,null,0]
[81,null,null,null,{"$f":"IF(COUNTA(H815:AA815)=0,\"\",COUNTA(H815:AA815))","v":""},null,null,null,null,null,null,null,null,null,null,null,null,null,null,null,null,null,null,null,null,null,null,0,{"$f":"AB815-AB814","v":0}]
[null,null,null,null,null,null,null,null,null,null,null,null,null,null,null,null,null,null,null,null,null,null,null,null,null,null,null,0]
[81,null,null,null,{"$f":"IF(COUNTA(H817:AA817)=0,\"\",COUNTA(H817:AA817))","v":""},null,null,null,null,null,null,null,null,null,null,null,null,null,null,null,null,null,null,null,null,null,null,0,{"$f":"AB817-AB816","v":0}]
[null,null,null,null,null,null,null,46,null,null,null,null,null,null,null,null,null,null,null,null,null,null,null,null,null,null,null,1]
[81,null,null,null,{"$f":"IF(COUNTA(H819:AA819)=0,\"\",COUNTA(H819:AA819))","v":1},"LHR","名児耶","*14",null,null,null,null,null,null,null,null,null,null,null,null,null,null,null,null,null,null,null,1,{"$f":"AB819-AB818","v":0}]
[null,null,null,null,null,null,null,null,null,null,null,null,null,null,null,null,null,null,null,null,null,null,null,null,null,null,null,0]
[82,"体",{"$f":"IF(G2400=\"\",\"\",G2400)","v":"国延"},null,{"$f":"IF(COUNTA(H821:AA821)=0,\"\",COUNTA(H821:AA821))","v":""},null,null,null,null,null,null,null,null,null,null,null,null,null,null,null,null,null,null,null,null,null,null,0,{"$f":"AB821-AB820","v":0}]
[null,null,null,null,null,null,null,null,null,null,null,null,null,null,null,null,null,null,null,null,null,null,null,null,null,null,null,0]
[82," ",null,null,{"$f":"IF(COUNTA(H823:AA823)=0,\"\",COUNTA(H823:AA823))","v":""},null,null,null,null,null,null,null,null,null,null,null,null,null,null,null,null,null,null,null,null,null,null,0,{"$f":"AB823-AB822","v":0}]
[null,null,null,null,null,null,null,null,null,null,null,null,null,null,null,null,null,null,null,null,null,null,null,null,null,null,null,0]
[82,null,null,null,{"$f":"IF(COUNTA(H825:AA825)=0,\"\",COUNTA(H825:AA825))","v":""},null,null,null,null,null,null,null,null,null,null,null,null,null,null,null,null,null,null,null,null,null,null,0,{"$f":"AB825-AB824","v":0}]
[null,null,null,null,null,null,null,null,null,null,null,null,null,null,null,null,null,null,null,null,null,null,null,null,null,null,null,0]
[82,null,null,null,{"$f":"IF(COUNTA(H827:AA827)=0,\"\",COUNTA(H827:AA827))","v":""},null,null,null,null,null,null,null,null,null,null,null,null,null,null,null,null,null,null,null,null,null,null,0,{"$f":"AB827-AB826","v":0}]
[null,null,null,null,null,null,null,null,null,null,null,null,null,null,null,null,null,null,null,null,null,null,null,null,null,null,null,0]
[82," ",null,null,{"$f":"IF(COUNTA(H829:AA829)=0,\"\",COUNTA(H829:AA829))","v":""},null,null,null,null,null,null,null,null,null,null,null,null,null,null,null,null,null,null,null,null,null,null,0,{"$f":"AB829-AB828","v":0}]
[null,null,null,null,null,null,null,null,null,null,null,null,null,null,null,null,null,null,null,null,null,null,null,null,null,null,null,0]
[82,null,null,null,{"$f":"IF(COUNTA(H831:AA831)=0,\"\",COUNTA(H831:AA831))","v":""},null,null,null,null,null,null,null,null,null,null,null,null,null,null,null,null,null,null,null,null,null,null,0,{"$f":"AB831-AB830","v":0}]
[null,null,null,null,null,null,null,null,null,null,null,null,null,null,null,null,null,null,null,null,null,null,null,null,null,null,null,0]
[82,null,null,null,{"$f":"IF(COUNTA(H833:AA833)=0,\"\",COUNTA(H833:AA833))","v":""},null,null,null,null,null,null,null,null,null,null,null,null,null,null,null,null,null,null,null,null,null,null,0,{"$f":"AB833-AB832","v":0}]
[null,null,null,null,null,null,null,null,null,null,null,null,null,null,null,null,null,null,null,null,null,null,null,null,null,null,null,0]
[82,null,null,null,{"$f":"IF(COUNTA(H835:AA835)=0,\"\",COUNTA(H835:AA835))","v":""},null,null,null,null,null,null,null,null,null,null,null,null,null,null,null,null,null,null,null,null,null,null,0,{"$f":"AB835-AB834","v":0}]
[null,null,null,null,null,null,null,null,null,null,null,null,null,null,null,null,null,null,null,null,null,null,null,null,null,null,null,{"$f":"COUNTA(H836:AA836)","v":0}]
[83,null,{"$f":"IF(G2402=\"\",\"\",G2402)","v":"八木"},null,{"$f":"IF(COUNTA(H837:AA837)=0,\"\",COUNTA(H837:AA837))","v":""},null,null,null,null,null,null,null,null,null,null,null,null,null,null,null,null,null,null,null,null,null,null,0,{"$f":"AB837-AB836","v":0}]
[null,null,null,null,null,null,null,null,null,null,null,null,null,null,null,null,null,null,null,null,null,null,null,null,null,null,null,0]
[83,null,null,null,{"$f":"IF(COUNTA(H839:AA839)=0,\"\",COUNTA(H839:AA839))","v":""},null,null,null,null,null,null,null,null,null,null,null,null,null,null,null,null,null,null,null,null,null,null,0,{"$f":"AB839-AB838","v":0}]
[null,null,null,null,null,null,null,null,null,null,null,null,null,null,null,null,null,null,null,null,null,null,null,null,null,null,null,0]
[83,null,null,null,{"$f":"IF(COUNTA(H841:AA841)=0,\"\",COUNTA(H841:AA841))","v":""},null,null,null,null,null,null,null,null,null,null,null,null,null,null,null,null,null,null,null,null,null,null,0,{"$f":"AB841-AB840","v":0}]
[null,null,null,null,null,null,null,null,null,null,null,null,null,null,null,null,null,null,null,null,null,null,null,null,null,null,null,0]
[83,null,null,null,{"$f":"IF(COUNTA(H843:AA843)=0,\"\",COUNTA(H843:AA843))","v":""},null,null,null,null,null,null,null,null,null,null,null,null,null,null,null,null,null,null,null,null,null,null,0,{"$f":"AB843-AB842","v":0}]
[null,null,null,null,null,null,null,null,null,null,null,null,null,null,null,null,null,null,null,null,null,null,null,null,null,null,null,0]
[83,null,null,null,{"$f":"IF(COUNTA(H845:AA845)=0,\"\",COUNTA(H845:AA845))","v":""},null,null,null,null,null,null,null,null,null,null,null,null,null,null,null,null,null,null,null,null,null,null,0,{"$f":"AB845-AB844","v":0}]
[null,null,null,null,null,null,null,null,null,null,null,null,null,null,null,null,null,null,null,null,null,null,null,null,null,null,null,0]
[83,null,null,null,{"$f":"IF(COUNTA(H847:AA847)=0,\"\",COUNTA(H847:AA847))","v":""},null,null,null,null,null,null,null,null,null,null,null,null,null,null,null,null,null,null,null,null,null,null,0,{"$f":"AB847-AB846","v":0}]
[null,null,null,null,null,null,null,null,null,null,null,null,null,null,null,null,null,null,null,null,null,null,null,null,null,null,null,0]
[83,null,null,null,{"$f":"IF(COUNTA(H849:AA849)=0,\"\",COUNTA(H849:AA849))","v":""},null,null,null,null,null,null,null,null,null,null,null,null,null,null,null,null,null,null,null,null,null,null,0,{"$f":"AB849-AB848","v":0}]
[null,null,null,null,null,null,null,46,null,null,null,null,null,null,null,null,null,null,null,null,null,null,null,null,null,null,null,1]
[83," ",null,null,{"$f":"IF(COUNTA(H851:AA851)=0,\"\",COUNTA(H851:AA851))","v":1},"LHR","八木","*21",null,null,null,null,null,null,null,null,null,null,null,null,null,null,null,null,null,null,null,1,{"$f":"AB851-AB850","v":0}]
[null,null,null,null,null,null,null,null,null,null,null,null,null,null,null,null,null,null,null,null,null,null,null,null,null,null,null,0]
[84,null,{"$f":"IF(G2404=\"\",\"\",G2404)","v":"仙徳"},null,{"$f":"IF(COUNTA(H853:AA853)=0,\"\",COUNTA(H853:AA853))","v":""},null,null,null,null,null,null,null,null,null,null,null,null,null,null,null,null,null,null,null,null,null,null,0,{"$f":"AB853-AB852","v":0}]
[null,null,null,null,null,null,null,null,null,null,null,null,null,null,null,null,null,null,null,null,null,null,null,null,null,null,null,0]
[84,null,null,null,{"$f":"IF(COUNTA(H855:AA855)=0,\"\",COUNTA(H855:AA855))","v":""},null,null,null,null,null,null,null,null,null,null,null,null,null,null,null,null,null,null,null,null,null,null,0,{"$f":"AB855-AB854","v":0}]
[null,null,null,null,null,null,null,null,null,null,null,null,null,null,null,null,null,null,null,null,null,null,null,null,null,null,null,0]
[84,null,null,null,{"$f":"IF(COUNTA(H857:AA857)=0,\"\",COUNTA(H857:AA857))","v":""},null,null,null,null,null,null,null,null,null,null,null,null,null,null,null,null,null,null,null,null,null,null,0,{"$f":"AB857-AB856","v":0}]
[null,null,null,null,null,null,null,null,null,null,null,null,null,null,null,null,null,null,null,null,null,null,null,null,null,null,null,0]
[84,null,null,null,{"$f":"IF(COUNTA(H859:AA859)=0,\"\",COUNTA(H859:AA859))","v":""},null,null,null,null,null,null,null,null,null,null,null,null,null,null,null,null,null,null,null,null,null,null,0,{"$f":"AB859-AB858","v":0}]
[null,null,null,null,null,null,null,null,null,null,null,null,null,null,null,null,null,null,null,null,null,null,null,null,null,null,null,0]
[84,null,null,null,{"$f":"IF(COUNTA(H861:AA861)=0,\"\",COUNTA(H861:AA861))","v":""},null,null,null,null,null,null,null,null,null,null,null,null,null,null,null,null,null,null,null,null,null,null,0,{"$f":"AB861-AB860","v":0}]
[null,null,null,null,null,null,null,null,null,null,null,null,null,null,null,null,null,null,null,null,null,null,null,null,null,null,null,0]
[84,null,null,null,{"$f":"IF(COUNTA(H863:AA863)=0,\"\",COUNTA(H863:AA863))","v":""},null,null,null,null,null,null,null,null,null,null,null,null,null,null,null,null,null,null,null,null,null,null,0,{"$f":"AB863-AB862","v":0}]
[null,null,null,null,null,null,null,null,null,null,null,null,null,null,null,null,null,null,null,null,null,null,null,null,null,null,null,0]
[84,null,null,null,{"$f":"IF(COUNTA(H865:AA865)=0,\"\",COUNTA(H865:AA865))","v":""},null,null,null,null,null,null,null,null,null,null,null,null,null,null,null,null,null,null,null,null,null,null,0,{"$f":"AB865-AB864","v":0}]
[null,null,null,null,null,null,null,46,null,null,null,null,null,null,null,null,null,null,null,null,null,null,null,null,null,null,null,1]
[84,null,null,null,{"$f":"IF(COUNTA(H867:AA867)=0,\"\",COUNTA(H867:AA867))","v":1},"LHR","仙徳","*27",null,null,null,null,null,null,null,null,null,null,null,null,null,null,null,null,null,null,null,1,{"$f":"AB867-AB866","v":0}]
[null,null,null,null,null,null,null,null,null,null,null,null,null,null,null,null,null,null,null,null,null,null,null,null,null,null,null,0]
[85,null,{"$f":"IF(G2406=\"\",\"\",G2406)","v":"大徳"},null,{"$f":"IF(COUNTA(H869:AA869)=0,\"\",COUNTA(H869:AA869))","v":""},null,null,null,null,null,null,null,null,null,null,null,null,null,null,null,null,null,null,null,null,null,null,0,{"$f":"AB869-AB868","v":0}]
[null,null,null,null,null,null,null,null,null,null,null,null,null,null,null,null,null,null,null,null,null,null,null,null,null,null,null,0]
[85,null,null,null,{"$f":"IF(COUNTA(H871:AA871)=0,\"\",COUNTA(H871:AA871))","v":""},null,null,null,null,null,null,null,null,null,null,null,null,null,null,null,null,null,null,null,null,null,null,0,{"$f":"AB871-AB870","v":0}]
[null,null,null,null,null,null,null,null,null,null,null,null,null,null,null,null,null,null,null,null,null,null,null,null,null,null,null,0]
[85,null,null,null,{"$f":"IF(COUNTA(H873:AA873)=0,\"\",COUNTA(H873:AA873))","v":""},null,null,null,null,null,null,null,null,null,null,null,null,null,null,null,null,null,null,null,null,null,null,0,{"$f":"AB873-AB872","v":0}]
[null,null,null,null,null,null,null,null,null,null,null,null,null,null,null,null,null,null,null,null,null,null,null,null,null,null,null,0]
[85,null,null,null,{"$f":"IF(COUNTA(H875:AA875)=0,\"\",COUNTA(H875:AA875))","v":""},null,null,null,null,null,null,null,null,null,null,null,null,null,null,null,null,null,null,null,null,null,null,0,{"$f":"AB875-AB874","v":0}]
[null,null,null,null,null,null,null,null,null,null,null,null,null,null,null,null,null,null,null,null,null,null,null,null,null,null,null,0]
[85,null,null,null,{"$f":"IF(COUNTA(H877:AA877)=0,\"\",COUNTA(H877:AA877))","v":""},null,null,null,null,null,null,null,null,null,null,null,null,null,null,null,null,null,null,null,null,null,null,0,{"$f":"AB877-AB876","v":0}]
[null,null,null,null,null,null,null,null,null,null,null,null,null,null,null,null,null,null,null,null,null,null,null,null,null,null,null,0]
[85," ",null,null,{"$f":"IF(COUNTA(H879:AA879)=0,\"\",COUNTA(H879:AA879))","v":""},null,null,null,null,null,null,null,null,null,null,null,null,null,null,null,null,null,null,null,null,null,null,0,{"$f":"AB879-AB878","v":0}]
[null,null,null,null,null,null,null,null,null,null,null,null,null,null,null,null,null,null,null,null,null,null,null,null,null,null,null,0]
[85," ",null,null,{"$f":"IF(COUNTA(H881:AA881)=0,\"\",COUNTA(H881:AA881))","v":""},null,null,null,null,null,null,null,null,null,null,null,null,null,null,null,null,null,null,null,null,null,null,0,{"$f":"AB881-AB880","v":0}]
[null,null,null,null,null,null,null,null,null,null,null,null,null,null,null,null,null,null,null,null,null,null,null,null,null,null,null,0]
[85,null,null,null,{"$f":"IF(COUNTA(H883:AA883)=0,\"\",COUNTA(H883:AA883))","v":""},null,null,null,null,null,null,null,null,null,null,null,null,null,null,null,null,null,null,null,null,null,null,0,{"$f":"AB883-AB882","v":0}]
[null,null,null,null,null,null,null,null,null,null,null,null,null,null,null,null,null,null,null,null,null,null,null,null,null,null,null,0]
[86,null,{"$f":"IF(G2408=\"\",\"\",G2408)","v":"山崎"},null,{"$f":"IF(COUNTA(H885:AA885)=0,\"\",COUNTA(H885:AA885))","v":""},null,null,null,null,null,null,null,null,null,null,null,null,null,null,null,null,null,null,null,null,null,null,0,{"$f":"AB885-AB884","v":0}]
[null,null,null,null,null,null,null,null,null,null,null,null,null,null,null,null,null,null,null,null,null,null,null,null,null,null,null,0]
[86,null,null,null,{"$f":"IF(COUNTA(H887:AA887)=0,\"\",COUNTA(H887:AA887))","v":""},null,null,null,null,null,null,null,null,null,null,null,null,null,null,null,null,null,null,null,null,null,null,0,{"$f":"AB887-AB886","v":0}]
[null,null,null,null,null,null,null,null,null,null,null,null,null,null,null,null,null,null,null,null,null,null,null,null,null,null,null,0]
[86,null,null,null,{"$f":"IF(COUNTA(H889:AA889)=0,\"\",COUNTA(H889:AA889))","v":""},null,null,null,null,null,null,null,null,null,null,null,null,null,null,null,null,null,null,null,null,null,null,0,{"$f":"AB889-AB888","v":0}]
[null,null,null,null,null,null,null,null,null,null,null,null,null,null,null,null,null,null,null,null,null,null,null,null,null,null,null,0]
[86,null,null,null,{"$f":"IF(COUNTA(H891:AA891)=0,\"\",COUNTA(H891:AA891))","v":""},null,null,null,null,null,null,null,null,null,null,null,null,null,null,null,null,null,null,null,null,null,null,0,{"$f":"AB891-AB890","v":0}]
[null,null,null,null,null,null,null,null,null,null,null,null,null,null,null,null,null,null,null,null,null,null,null,null,null,null,null,0]
[86,null,null,null,{"$f":"IF(COUNTA(H893:AA893)=0,\"\",COUNTA(H893:AA893))","v":""},null,null,null,null,null,null,null,null,null,null,null,null,null,null,null,null,null,null,null,null,null,null,0,{"$f":"AB893-AB892","v":0}]
[null,null,null,null,null,null,null,null,null,null,null,null,null,null,null,null,null,null,null,null,null,null,null,null,null,null,null,0]
[86,null,null,null,{"$f":"IF(COUNTA(H895:AA895)=0,\"\",COUNTA(H895:AA895))","v":""},null,null,null,null,null,null,null,null,null,null,null,null,null,null,null,null,null,null,null,null,null,null,0,{"$f":"AB895-AB894","v":0}]
[null,null,null,null,null,null,null,null,null,null,null,null,null,null,null,null,null,null,null,null,null,null,null,null,null,null,null,0]
[86,null,null,null,{"$f":"IF(COUNTA(H897:AA897)=0,\"\",COUNTA(H897:AA897))","v":""},null,null,null,null,null,null,null,null,null,null,null,null,null,null,null,null,null,null,null,null,null,null,0,{"$f":"AB897-AB896","v":0}]
[null,null,null,null,null,null,null,46,null,null,null,null,null,null,null,null,null,null,null,null,null,null,null,null,null,null,null,1]
[86," ",null,null,{"$f":"IF(COUNTA(H899:AA899)=0,\"\",COUNTA(H899:AA899))","v":1},"LHR","山崎","*32",null,null,null,null,null,null,null,null,null,null,null,null,null,null,null,null,null,null,null,1,{"$f":"AB899-AB898","v":0}]
[null,null,null,null,null,null,null,null,null,null,null,null,null,null,null,null,null,null,null,null,null,null,null,null,null,null,null,{"$f":"COUNTA(H900:AA900)","v":0}]
[87,null,{"$f":"IF(G2410=\"\",\"\",G2410)","v":"井上"},null,{"$f":"IF(COUNTA(H901:AA901)=0,\"\",COUNTA(H901:AA901))","v":""},null,null,null,null,null,null,null,null,null,null,null,null,null,null,null,null,null,null,null,null,null,null,0,{"$f":"AB901-AB900","v":0}]
[null,null,null,null,null,null,null,null,null,null,null,null,null,null,null,null,null,null,null,null,null,null,null,null,null,null,null,0]
[87,null,null,null,{"$f":"IF(COUNTA(H903:AA903)=0,\"\",COUNTA(H903:AA903))","v":""},null,null,null,null,null,null,null,null,null,null,null,null,null,null,null,null,null,null,null,null,null,null,0,{"$f":"AB903-AB902","v":0}]
[null,null,null,null,null,null,null,null,null,null,null,null,null,null,null,null,null,null,null,null,null,null,null,null,null,null,null,0]
[87,null,null,null,{"$f":"IF(COUNTA(H905:AA905)=0,\"\",COUNTA(H905:AA905))","v":""},null,null,null,null,null,null,null,null,null,null,null,null,null,null,null,null,null,null,null,null,null,null,0,{"$f":"AB905-AB904","v":0}]
[null,null,null,null,null,null,null,null,null,null,null,null,null,null,null,null,null,null,null,null,null,null,null,null,null,null,null,0]
[87,null,null,null,{"$f":"IF(COUNTA(H907:AA907)=0,\"\",COUNTA(H907:AA907))","v":""},null,null,null,null,null,null,null,null,null,null,null,null,null,null,null,null,null,null,null,null,null,null,0,{"$f":"AB907-AB906","v":0}]
[null,null,null,null,null,null,null,null,null,null,null,null,null,null,null,null,null,null,null,null,null,null,null,null,null,null,null,0]
[87,null,null,null,{"$f":"IF(COUNTA(H909:AA909)=0,\"\",COUNTA(H909:AA909))","v":""},null,null,null,null,null,null,null,null,null,null,null,null,null,null,null,null,null,null,null,null,null,null,0,{"$f":"AB909-AB908","v":0}]
[null,null,null,null,null,null,null,null,null,null,null,null,null,null,null,null,null,null,null,null,null,null,null,null,null,null,null,0]
[87,null,null,null,{"$f":"IF(COUNTA(H911:AA911)=0,\"\",COUNTA(H911:AA911))","v":""},null,null,null,null,null,null,null,null,null,null,null,null,null,null,null,null,null,null,null,null,null,null,0,{"$f":"AB911-AB910","v":0}]
[null,null,null,null,null,null,null,null,null,null,null,null,null,null,null,null,null,null,null,null,null,null,null,null,null,null,null,0]
[87,null,null,null,{"$f":"IF(COUNTA(H913:AA913)=0,\"\",COUNTA(H913:AA913))","v":""},null,null,null,null,null,null,null,null,null,null,null,null,null,null,null,null,null,null,null,null,null,null,0,{"$f":"AB913-AB912","v":0}]
[null,null,null,null,null,null,null,46,null,null,null,null,null,null,null,null,null,null,null,null,null,null,null,null,null,null,null,1]
[87," ",null,null,{"$f":"IF(COUNTA(H915:AA915)=0,\"\",COUNTA(H915:AA915))","v":1},"LHR","井上","*37",null,null,null,null,null,null,null,null,null,null,null,null,null,null,null,null,null,null,null,1,{"$f":"AB915-AB914","v":0}]
[null,null,null,null,null,null,null,null,null,null,null,null,null,null,null,null,null,null,null,null,null,null,null,null,null,null,null,0]
[88,null,{"$f":"IF(G2412=\"\",\"\",G2412)","v":"t88"},null,{"$f":"IF(COUNTA(H917:AA917)=0,\"\",COUNTA(H917:AA917))","v":""},null,null,null,null,null,null,null,null,null,null,null,null,null,null,null,null,null,null,null,null,null,null,0,{"$f":"AB917-AB916","v":0}]
[null,null,null,null,null,null,null,null,null,null,null,null,null,null,null,null,null,null,null,null,null,null,null,null,null,null,null,0]
[88,null,null,null,{"$f":"IF(COUNTA(H919:AA919)=0,\"\",COUNTA(H919:AA919))","v":""},null,null,null,null,null,null,null,null,null,null,null,null,null,null,null,null,null,null,null,null,null,null,0,{"$f":"AB919-AB918","v":0}]
[null,null,null,null,null,null,null,null,null,null,null,null,null,null,null,null,null,null,null,null,null,null,null,null,null,null,null,0]
[88,null,null,null,{"$f":"IF(COUNTA(H921:AA921)=0,\"\",COUNTA(H921:AA921))","v":""},null,null,null,null,null,null,null,null,null,null,null,null,null,null,null,null,null,null,null,null,null,null,0,{"$f":"AB921-AB920","v":0}]
[null,null,null,null,null,null,null,null,null,null,null,null,null,null,null,null,null,null,null,null,null,null,null,null,null,null,null,0]
[88,null,null,null,{"$f":"IF(COUNTA(H923:AA923)=0,\"\",COUNTA(H923:AA923))","v":""},null,null,null,null,null,null,null,null,null,null,null,null,null,null,null,null,null,null,null,null,null,null,0,{"$f":"AB923-AB922","v":0}]
[null,null,null,null,null,null,null,null,null,null,null,null,null,null,null,null,null,null,null,null,null,null,null,null,null,null,null,0]
[88,null,null,null,{"$f":"IF(COUNTA(H925:AA925)=0,\"\",COUNTA(H925:AA925))","v":""},null,null,null,null,null,null,null,null,null,null,null,null,null,null,null,null,null,null,null,null,null,null,0,{"$f":"AB925-AB924","v":0}]
[null,null,null,null,null,null,null,null,null,null,null,null,null,null,null,null,null,null,null,null,null,null,null,null,null,null,null,0]
[88," ",null,null,{"$f":"IF(COUNTA(H927:AA927)=0,\"\",COUNTA(H927:AA927))","v":""},null,null,null,null,null,null,null,null,null,null,null,null,null,null,null,null,null,null,null,null,null,null,0,{"$f":"AB927-AB926","v":0}]
[null,null,null,null,null,null,null,null,null,null,null,null,null,null,null,null,null,null,null,null,null,null,null,null,null,null,null,0]
[88,null,null,null,{"$f":"IF(COUNTA(H929:AA929)=0,\"\",COUNTA(H929:AA929))","v":""},null,null,null,null,null,null,null,null,null,null,null,null,null,null,null,null,null,null,null,null,null,null,0,{"$f":"AB929-AB928","v":0}]
[null,null,null,null,null,null,null,null,null,null,null,null,null,null,null,null,null,null,null,null,null,null,null,null,null,null,null,0]
[88,"育",null,null,{"$f":"IF(COUNTA(H931:AA931)=0,\"\",COUNTA(H931:AA931))","v":""},null,null,null,null,null,null,null,null,null,null,null,null,null,null,null,null,null,null,null,null,null,null,0,{"$f":"AB931-AB930","v":0}]
[null,null,null,null,null,null,null,null,null,null,null,null,null,null,null,null,null,null,null,null,null,null,null,null,null,null,null,0]
[89,null,{"$f":"G2414","v":"t89"},null,null,null,null,null,null,null,null,null,null,null,null,null,null,null,null,null,null,null,null,null,null,null,null,0,{"$f":"AB933-AB932","v":0}]
[null,null,null,null,null,null,null,null,null,null,null,null,null,null,null,null,null,null,null,null,null,null,null,null,null,null,null,0]
[89,null,null,null,null,null,null,null,null,null,null,null,null,null,null,null,null,null,null,null,null,null,null,null,null,null,null,0,{"$f":"AB935-AB934","v":0}]
[null,null,null,null,null,null,null,null,null,null,null,null,null,null,null,null,null,null,null,null,null,null,null,null,null,null,null,0]
[89,null,null,null,null,null,null,null,null,null,null,null,null,null,null,null,null,null,null,null,null,null,null,null,null,null,null,0,{"$f":"AB937-AB936","v":0}]
[null,null,null,null,null,null,null,null,null,null,null,null,null,null,null,null,null,null,null,null,null,null,null,null,null,null,null,0]
[89,null,null,null,null,null,null,null,null,null,null,null,null,null,null,null,null,null,null,null,null,null,null,null,null,null,null,0,{"$f":"AB939-AB938","v":0}]
[null,null,null,null,null,null,null,null,null,null,null,null,null,null,null,null,null,null,null,null,null,null,null,null,null,null,null,0]
[89,null,null,null,null,null,null,null,null,null,null,null,null,null,null,null,null,null,null,null,null,null,null,null,null,null,null,0,{"$f":"AB941-AB940","v":0}]
[null,null,null,null,null,null,null,null,null,null,null,null,null,null,null,null,null,null,null,null,null,null,null,null,null,null,null,0]
[89,null,null,null,null,null,null,null,null,null,null,null,null,null,null,null,null,null,null,null,null,null,null,null,null,null,null,0,{"$f":"AB943-AB942","v":0}]
[null,null,null,null,null,null,null,null,null,null,null,null,null,null,null,null,null,null,null,null,null,null,null,null,null,null,null,0]
[89,null,null,null,null,null,null,null,null,null,null,null,null,null,null,null,null,null,null,null,null,null,null,null,null,null,null,0,{"$f":"AB945-AB944","v":0}]
[null,null,null,null,null,null,null,null,null,null,null,null,null,null,null,null,null,null,null,null,null,null,null,null,null,null,null,0]
[89,null,null,null,null,null,null,null,null,null,null,null,null,null,null,null,null,null,null,null,null,null,null,null,null,null,null,0,{"$f":"AB947-AB946","v":0}]
[null,null,null,null,null,null,null,null,null,null,null,null,null,null,null,null,null,null,null,null,null,null,null,null,null,null,null,0]
[90,null,{"$f":"G2416","v":"t90"},null,null,null,null,null,null,null,null,null,null,null,null,null,null,null,null,null,null,null,null,null,null,null,null,0,{"$f":"AB949-AB948","v":0}]
[null,null,null,null,null,null,null,null,null,null,null,null,null,null,null,null,null,null,null,null,null,null,null,null,null,null,null,0]
[90,null,null,null,null,null,null,null,null,null,null,null,null,null,null,null,null,null,null,null,null,null,null,null,null,null,null,0,{"$f":"AB951-AB950","v":0}]
[null,null,null,null,null,null,null,null,null,null,null,null,null,null,null,null,null,null,null,null,null,null,null,null,null,null,null,0]
[90,null,null,null,null,null,null,null,null,null,null,null,null,null,null,null,null,null,null,null,null,null,null,null,null,null,null,0,{"$f":"AB953-AB952","v":0}]
[null,null,null,null,null,null,null,null,null,null,null,null,null,null,null,null,null,null,null,null,null,null,null,null,null,null,null,0]
[90,null,null,null,null,null,null,null,null,null,null,null,null,null,null,null,null,null,null,null,null,null,null,null,null,null,null,0,{"$f":"AB955-AB954","v":0}]
[null,null,null,null,null,null,null,null,null,null,null,null,null,null,null,null,null,null,null,null,null,null,null,null,null,null,null,0]
[90,null,null,null,null,null,null,null,null,null,null,null,null,null,null,null,null,null,null,null,null,null,null,null,null,null,null,0,{"$f":"AB957-AB956","v":0}]
[null,null,null,null,null,null,null,null,null,null,null,null,null,null,null,null,null,null,null,null,null,null,null,null,null,null,null,0]
[90,null,null,null,null,null,null,null,null,null,null,null,null,null,null,null,null,null,null,null,null,null,null,null,null,null,null,0,{"$f":"AB959-AB958","v":0}]
[null,null,null,null,null,null,null,null,null,null,null,null,null,null,null,null,null,null,null,null,null,null,null,null,null,null,null,0]
[90,null,null,null,null,null,null,null,null,null,null,null,null,null,null,null,null,null,null,null,null,null,null,null,null,null,null,0,{"$f":"AB961-AB960","v":0}]
[null,null,null,null,null,null,null,null,null,null,null,null,null,null,null,null,null,null,null,null,null,null,null,null,null,null,null,0]
[90,null,null,null,null,null,null,null,null,null,null,null,null,null,null,null,null,null,null,null,null,null,null,null,null,null,null,0,{"$f":"AB963-AB962","v":0}]
[null,null,null,null,null,null,null,null,null,null,null,null,null,null,null,null,null,null,null,null,null,null,null,null,null,null,null,{"$f":"COUNTA(H964:AA964)","v":0}]
[91,null,{"$f":"G2418","v":"t91"},null,null,null,null,null,null,null,null,null,null,null,null,null,null,null,null,null,null,null,null,null,null,null,null,0,{"$f":"AB965-AB964","v":0}]
[null,null,null,null,null,null,null,null,null,null,null,null,null,null,null,null,null,null,null,null,null,null,null,null,null,null,null,0]
[91,null,null,null,null,null,null,null,null,null,null,null,null,null,null,null,null,null,null,null,null,null,null,null,null,null,null,0,{"$f":"AB967-AB966","v":0}]
[null,null,null,null,null,null,null,null,null,null,null,null,null,null,null,null,null,null,null,null,null,null,null,null,null,null,null,0]
[91,null,null,null,null,null,null,null,null,null,null,null,null,null,null,null,null,null,null,null,null,null,null,null,null,null,null,0,{"$f":"AB969-AB968","v":0}]
[null,null,null,null,null,null,null,null,null,null,null,null,null,null,null,null,null,null,null,null,null,null,null,null,null,null,null,0]
[91,null,null,null,null,null,null,null,null,null,null,null,null,null,null,null,null,null,null,null,null,null,null,null,null,null,null,0,{"$f":"AB971-AB970","v":0}]
[null,null,null,null,null,null,null,null,null,null,null,null,null,null,null,null,null,null,null,null,null,null,null,null,null,null,null,0]
[91,null,null,null,null,null,null,null,null,null,null,null,null,null,null,null,null,null,null,null,null,null,null,null,null,null,null,0,{"$f":"AB973-AB972","v":0}]
[null,null,null,null,null,null,null,null,null,null,null,null,null,null,null,null,null,null,null,null,null,null,null,null,null,null,null,0]
[91,null,null,null,null,null,null,null,null,null,null,null,null,null,null,null,null,null,null,null,null,null,null,null,null,null,null,0,{"$f":"AB975-AB974","v":0}]
[null,null,null,null,null,null,null,null,null,null,null,null,null,null,null,null,null,null,null,null,null,null,null,null,null,null,null,0]
[91,null,null,null,null,null,null,null,null,null,null,null,null,null,null,null,null,null,null,null,null,null,null,null,null,null,null,0,{"$f":"AB977-AB976","v":0}]
[null,null,null,null,null,null,null,null,null,null,null,null,null,null,null,null,null,null,null,null,null,null,null,null,null,null,null,0]
[91,null,null,null,null,null,null,null,null,null,null,null,null,null,null,null,null,null,null,null,null,null,null,null,null,null,null,0,{"$f":"AB979-AB978","v":0}]
[null,null,null,null,null,null,null,null,null,null,null,null,null,null,null,null,null,null,null,null,null,null,null,null,null,null,null,0]
[92,null,{"$f":"G2420","v":"t92"},null,null,null,null,null,null,null,null,null,null,null,null,null,null,null,null,null,null,null,null,null,null,null,null,0,{"$f":"AB981-AB980","v":0}]
[null,null,null,null,null,null,null,null,null,null,null,null,null,null,null,null,null,null,null,null,null,null,null,null,null,null,null,0]
[92,null,null,null,null,null,null,null,null,null,null,null,null,null,null,null,null,null,null,null,null,null,null,null,null,null,null,0,{"$f":"AB983-AB982","v":0}]
[null,null,null,null,null,null,null,null,null,null,null,null,null,null,null,null,null,null,null,null,null,null,null,null,null,null,null,0]
[92,null,null,null,null,null,null,null,null,null,null,null,null,null,null,null,null,null,null,null,null,null,null,null,null,null,null,0,{"$f":"AB985-AB984","v":0}]
[null,null,null,null,null,null,null,null,null,null,null,null,null,null,null,null,null,null,null,null,null,null,null,null,null,null,null,0]
[92,null,null,null,null,null,null,null,null,null,null,null,null,null,null,null,null,null,null,null,null,null,null,null,null,null,null,0,{"$f":"AB987-AB986","v":0}]
[null,null,null,null,null,null,null,null,null,null,null,null,null,null,null,null,null,null,null,null,null,null,null,null,null,null,null,0]
[92,null,null,null,null,null,null,null,null,null,null,null,null,null,null,null,null,null,null,null,null,null,null,null,null,null,null,0,{"$f":"AB989-AB988","v":0}]
[null,null,null,null,null,null,null,null,null,null,null,null,null,null,null,null,null,null,null,null,null,null,null,null,null,null,null,0]
[92,null,null,null,null,null,null,null,null,null,null,null,null,null,null,null,null,null,null,null,null,null,null,null,null,null,null,0,{"$f":"AB991-AB990","v":0}]
[null,null,null,null,null,null,null,null,null,null,null,null,null,null,null,null,null,null,null,null,null,null,null,null,null,null,null,0]
[92,null,null,null,null,null,null,null,null,null,null,null,null,null,null,null,null,null,null,null,null,null,null,null,null,null,null,0,{"$f":"AB993-AB992","v":0}]
[null,null,null,null,null,null,null,null,null,null,null,null,null,null,null,null,null,null,null,null,null,null,null,null,null,null,null,0]
[92,null,null,null,null,null,null,null,null,null,null,null,null,null,null,null,null,null,null,null,null,null,null,null,null,null,null,0,{"$f":"AB995-AB994","v":0}]
[null,null,null,null,null,null,null,null,null,null,null,null,null,null,null,null,null,null,null,null,null,null,null,null,null,null,null,0]
[93,null,{"$f":"G2422","v":"t93"},null,null,null,null,null,null,null,null,null,null,null,null,null,null,null,null,null,null,null,null,null,null,null,null,0,{"$f":"AB997-AB996","v":0}]
[null,null,null,null,null,null,null,null,null,null,null,null,null,null,null,null,null,null,null,null,null,null,null,null,null,null,null,0]
[93,null,null,null,null,null,null,null,null,null,null,null,null,null,null,null,null,null,null,null,null,null,null,null,null,null,null,0,{"$f":"AB999-AB998","v":0}]
[null,null,null,null,null,null,null,null,null,null,null,null,null,null,null,null,null,null,null,null,null,null,null,null,null,null,null,0]
[93,null,null,null,null,null,null,null,null,null,null,null,null,null,null,null,null,null,null,null,null,null,null,null,null,null,null,0,{"$f":"AB1001-AB1000","v":0}]
[null,null,null,null,null,null,null,null,null,null,null,null,null,null,null,null,null,null,null,null,null,null,null,null,null,null,null,0]
[93,null,null,null,null,null,null,null,null,null,null,null,null,null,null,null,null,null,null,null,null,null,null,null,null,null,null,0,{"$f":"AB1003-AB1002","v":0}]
[null,null,null,null,null,null,null,null,null,null,null,null,null,null,null,null,null,null,null,null,null,null,null,null,null,null,null,0]
[93,null,null,null,null,null,null,null,null,null,null,null,null,null,null,null,null,null,null,null,null,null,null,null,null,null,null,0,{"$f":"AB1005-AB1004","v":0}]
[null,null,null,null,null,null,null,null,null,null,null,null,null,null,null,null,null,null,null,null,null,null,null,null,null,null,null,0]
[93,null,null,null,null,null,null,null,null,null,null,null,null,null,null,null,null,null,null,null,null,null,null,null,null,null,null,0,{"$f":"AB1007-AB1006","v":0}]
[null,null,null,null,null,null,null,null,null,null,null,null,null,null,null,null,null,null,null,null,null,null,null,null,null,null,null,0]
[93,null,null,null,null,null,null,null,null,null,null,null,null,null,null,null,null,null,null,null,null,null,null,null,null,null,null,0,{"$f":"AB1009-AB1008","v":0}]
[null,null,null,null,null,null,null,null,null,null,null,null,null,null,null,null,null,null,null,null,null,null,null,null,null,null,null,0]
[93,null,null,null,null,null,null,null,null,null,null,null,null,null,null,null,null,null,null,null,null,null,null,null,null,null,null,0,{"$f":"AB1011-AB1010","v":0}]
[null,null,null,null,null,null,null,null,null,null,null,null,null,null,null,null,null,null,null,null,null,null,null,null,null,null,null,0]
[94,null,{"$f":"G2424","v":"t94"},null,null,null,null,null,null,null,null,null,null,null,null,null,null,null,null,null,null,null,null,null,null,null,null,0,{"$f":"AB1013-AB1012","v":0}]
[null,null,null,null,null,null,null,null,null,null,null,null,null,null,null,null,null,null,null,null,null,null,null,null,null,null,null,0]
[94,null,null,null,null,null,null,null,null,null,null,null,null,null,null,null,null,null,null,null,null,null,null,null,null,null,null,0,{"$f":"AB1015-AB1014","v":0}]
[null,null,null,null,null,null,null,null,null,null,null,null,null,null,null,null,null,null,null,null,null,null,null,null,null,null,null,0]
[94,null,null,null,null,null,null,null,null,null,null,null,null,null,null,null,null,null,null,null,null,null,null,null,null,null,null,0,{"$f":"AB1017-AB1016","v":0}]
[null,null,null,null,null,null,null,null,null,null,null,null,null,null,null,null,null,null,null,null,null,null,null,null,null,null,null,0]
[94,null,null,null,null,null,null,null,null,null,null,null,null,null,null,null,null,null,null,null,null,null,null,null,null,null,null,0,{"$f":"AB1019-AB1018","v":0}]
[null,null,null,null,null,null,null,null,null,null,null,null,null,null,null,null,null,null,null,null,null,null,null,null,null,null,null,0]
[94,null,null,null,null,null,null,null,null,null,null,null,null,null,null,null,null,null,null,null,null,null,null,null,null,null,null,0,{"$f":"AB1021-AB1020","v":0}]
[null,null,null,null,null,null,null,null,null,null,null,null,null,null,null,null,null,null,null,null,null,null,null,null,null,null,null,0]
[94,null,null,null,null,null,null,null,null,null,null,null,null,null,null,null,null,null,null,null,null,null,null,null,null,null,null,0,{"$f":"AB1023-AB1022","v":0}]
[null,null,null,null,null,null,null,null,null,null,null,null,null,null,null,null,null,null,null,null,null,null,null,null,null,null,null,0]
[94,null,null,null,null,null,null,null,null,null,null,null,null,null,null,null,null,null,null,null,null,null,null,null,null,null,null,0,{"$f":"AB1025-AB1024","v":0}]
[null,null,null,null,null,null,null,null,null,null,null,null,null,null,null,null,null,null,null,null,null,null,null,null,null,null,null,0]
[94,null,null,null,null,null,null,null,null,null,null,null,null,null,null,null,null,null,null,null,null,null,null,null,null,null,null,0,{"$f":"AB1027-AB1026","v":0}]
[null,null,null,null,null,null,null,null,null,null,null,null,null,null,null,null,null,null,null,null,null,null,null,null,null,null,null,0]
[95,null,{"$f":"G2426","v":"t95"},null,null,null,null,null,null,null,null,null,null,null,null,null,null,null,null,null,null,null,null,null,null,null,null,0,{"$f":"AB1029-AB1028","v":0}]
[null,null,null,null,null,null,null,null,null,null,null,null,null,null,null,null,null,null,null,null,null,null,null,null,null,null,null,0]
[95,null,null,null,null,null,null,null,null,null,null,null,null,null,null,null,null,null,null,null,null,null,null,null,null,null,null,0,{"$f":"AB1031-AB1030","v":0}]
[null,null,null,null,null,null,null,null,null,null,null,null,null,null,null,null,null,null,null,null,null,null,null,null,null,null,null,0]
[95,null,null,null,null,null,null,null,null,null,null,null,null,null,null,null,null,null,null,null,null,null,null,null,null,null,null,0,{"$f":"AB1033-AB1032","v":0}]
[null,null,null,null,null,null,null,null,null,null,null,null,null,null,null,null,null,null,null,null,null,null,null,null,null,null,null,0]
[95,null,null,null,null,null,null,null,null,null,null,null,null,null,null,null,null,null,null,null,null,null,null,null,null,null,null,0,{"$f":"AB1035-AB1034","v":0}]
[null,null,null,null,null,null,null,null,null,null,null,null,null,null,null,null,null,null,null,null,null,null,null,null,null,null,null,0]
[95,null,null,null,null,null,null,null,null,null,null,null,null,null,null,null,null,null,null,null,null,null,null,null,null,null,null,0,{"$f":"AB1037-AB1036","v":0}]
[null,null,null,null,null,null,null,null,null,null,null,null,null,null,null,null,null,null,null,null,null,null,null,null,null,null,null,0]
[95,null,null,null,null,null,null,null,null,null,null,null,null,null,null,null,null,null,null,null,null,null,null,null,null,null,null,0,{"$f":"AB1039-AB1038","v":0}]
[null,null,null,null,null,null,null,null,null,null,null,null,null,null,null,null,null,null,null,null,null,null,null,null,null,null,null,0]
[95,null,null,null,null,null,null,null,null,null,null,null,null,null,null,null,null,null,null,null,null,null,null,null,null,null,null,0,{"$f":"AB1041-AB1040","v":0}]
[null,null,null,null,null,null,null,null,null,null,null,null,null,null,null,null,null,null,null,null,null,null,null,null,null,null,null,0]
[95,null,null,null,null,null,null,null,null,null,null,null,null,null,null,null,null,null,null,null,null,null,null,null,null,null,null,0,{"$f":"AB1043-AB1042","v":0}]
[null,null,null,null,null,null,null,null,null,null,null,null,null,null,null,null,null,null,null,null,null,null,null,null,null,null,null,{"$f":"COUNTA(H1044:AA1044)","v":0}]
[96,null,{"$f":"G2428","v":"t96"},null,null,null,null,null,null,null,null,null,null,null,null,null,null,null,null,null,null,null,null,null,null,null,null,0,{"$f":"AB1045-AB1044","v":0}]
[null,null,null,null,null,null,null,null,null,null,null,null,null,null,null,null,null,null,null,null,null,null,null,null,null,null,null,0]
[96,null,null,null,null,null,null,null,null,null,null,null,null,null,null,null,null,null,null,null,null,null,null,null,null,null,null,0,{"$f":"AB1047-AB1046","v":0}]
[null,null,null,null,null,null,null,null,null,null,null,null,null,null,null,null,null,null,null,null,null,null,null,null,null,null,null,0]
[96,null,null,null,null,null,null,null,null,null,null,null,null,null,null,null,null,null,null,null,null,null,null,null,null,null,null,0,{"$f":"AB1049-AB1048","v":0}]
[null,null,null,null,null,null,null,null,null,null,null,null,null,null,null,null,null,null,null,null,null,null,null,null,null,null,null,0]
[96,null,null,null,null,null,null,null,null,null,null,null,null,null,null,null,null,null,null,null,null,null,null,null,null,null,null,0,{"$f":"AB1051-AB1050","v":0}]
[null,null,null,null,null,null,null,null,null,null,null,null,null,null,null,null,null,null,null,null,null,null,null,null,null,null,null,0]
[96,null,null,null,null,null,null,null,null,null,null,null,null,null,null,null,null,null,null,null,null,null,null,null,null,null,null,0,{"$f":"AB1053-AB1052","v":0}]
[null,null,null,null,null,null,null,null,null,null,null,null,null,null,null,null,null,null,null,null,null,null,null,null,null,null,null,0]
[96,null,null,null,null,null,null,null,null,null,null,null,null,null,null,null,null,null,null,null,null,null,null,null,null,null,null,0,{"$f":"AB1055-AB1054","v":0}]
[null,null,null,null,null,null,null,null,null,null,null,null,null,null,null,null,null,null,null,null,null,null,null,null,null,null,null,0]
[96,null,null,null,null,null,null,null,null,null,null,null,null,null,null,null,null,null,null,null,null,null,null,null,null,null,null,0,{"$f":"AB1057-AB1056","v":0}]
[null,null,null,null,null,null,null,null,null,null,null,null,null,null,null,null,null,null,null,null,null,null,null,null,null,null,null,0]
[96,null,null,null,null,null,null,null,null,null,null,null,null,null,null,null,null,null,null,null,null,null,null,null,null,null,null,0,{"$f":"AB1059-AB1058","v":0}]
[null,null,null,null,null,null,null,null,null,null,null,null,null,null,null,null,null,null,null,null,null,null,null,null,null,null,null,0]
[97,null,{"$f":"G2430","v":"t97"},null,null,null,null,null,null,null,null,null,null,null,null,null,null,null,null,null,null,null,null,null,null,null,null,0,{"$f":"AB1061-AB1060","v":0}]
[null,null,null,null,null,null,null,null,null,null,null,null,null,null,null,null,null,null,null,null,null,null,null,null,null,null,null,0]
[97,null,null,null,null,null,null,null,null,null,null,null,null,null,null,null,null,null,null,null,null,null,null,null,null,null,null,0,{"$f":"AB1063-AB1062","v":0}]
[null,null,null,null,null,null,null,null,null,null,null,null,null,null,null,null,null,null,null,null,null,null,null,null,null,null,null,0]
[97,null,null,null,null,null,null,null,null,null,null,null,null,null,null,null,null,null,null,null,null,null,null,null,null,null,null,0,{"$f":"AB1065-AB1064","v":0}]
[null,null,null,null,null,null,null,null,null,null,null,null,null,null,null,null,null,null,null,null,null,null,null,null,null,null,null,0]
[97,null,null,null,null,null,null,null,null,null,null,null,null,null,null,null,null,null,null,null,null,null,null,null,null,null,null,0,{"$f":"AB1067-AB1066","v":0}]
[null,null,null,null,null,null,null,null,null,null,null,null,null,null,null,null,null,null,null,null,null,null,null,null,null,null,null,0]
[97,null,null,null,null,null,null,null,null,null,null,null,null,null,null,null,null,null,null,null,null,null,null,null,null,null,null,0,{"$f":"AB1069-AB1068","v":0}]
[null,null,null,null,null,null,null,null,null,null,null,null,null,null,null,null,null,null,null,null,null,null,null,null,null,null,null,0]
[97,null,null,null,null,null,null,null,null,null,null,null,null,null,null,null,null,null,null,null,null,null,null,null,null,null,null,0,{"$f":"AB1071-AB1070","v":0}]
[null,null,null,null,null,null,null,null,null,null,null,null,null,null,null,null,null,null,null,null,null,null,null,null,null,null,null,0]
[97,null,null,null,null,null,null,null,null,null,null,null,null,null,null,null,null,null,null,null,null,null,null,null,null,null,null,0,{"$f":"AB1073-AB1072","v":0}]
[null,null,null,null,null,null,null,null,null,null,null,null,null,null,null,null,null,null,null,null,null,null,null,null,null,null,null,0]
[97,null,null,null,null,null,null,null,null,null,null,null,null,null,null,null,null,null,null,null,null,null,null,null,null,null,null,0,{"$f":"AB1075-AB1074","v":0}]
[null,null,null,null,null,null,null,null,null,null,null,null,null,null,null,null,null,null,null,null,null,null,null,null,null,null,null,0]
[98,null,{"$f":"G2432","v":"t98"},null,null,null,null,null,null,null,null,null,null,null,null,null,null,null,null,null,null,null,null,null,null,null,null,0,{"$f":"AB1077-AB1076","v":0}]
[null,null,null,null,null,null,null,null,null,null,null,null,null,null,null,null,null,null,null,null,null,null,null,null,null,null,null,0]
[98,null,null,null,null,null,null,null,null,null,null,null,null,null,null,null,null,null,null,null,null,null,null,null,null,null,null,0,{"$f":"AB1079-AB1078","v":0}]
[null,null,null,null,null,null,null,null,null,null,null,null,null,null,null,null,null,null,null,null,null,null,null,null,null,null,null,0]
[98,null,null,null,null,null,null,null,null,null,null,null,null,null,null,null,null,null,null,null,null,null,null,null,null,null,null,0,{"$f":"AB1081-AB1080","v":0}]
[null,null,null,null,null,null,null,null,null,null,null,null,null,null,null,null,null,null,null,null,null,null,null,null,null,null,null,0]
[98,null,null,null,null,null,null,null,null,null,null,null,null,null,null,null,null,null,null,null,null,null,null,null,null,null,null,0,{"$f":"AB1083-AB1082","v":0}]
[null,null,null,null,null,null,null,null,null,null,null,null,null,null,null,null,null,null,null,null,null,null,null,null,null,null,null,0]
[98,null,null,null,null,null,null,null,null,null,null,null,null,null,null,null,null,null,null,null,null,null,null,null,null,null,null,0,{"$f":"AB1085-AB1084","v":0}]
[null,null,null,null,null,null,null,null,null,null,null,null,null,null,null,null,null,null,null,null,null,null,null,null,null,null,null,0]
[98,null,null,null,null,null,null,null,null,null,null,null,null,null,null,null,null,null,null,null,null,null,null,null,null,null,null,0,{"$f":"AB1087-AB1086","v":0}]
[null,null,null,null,null,null,null,null,null,null,null,null,null,null,null,null,null,null,null,null,null,null,null,null,null,null,null,0]
[98,null,null,null,null,null,null,null,null,null,null,null,null,null,null,null,null,null,null,null,null,null,null,null,null,null,null,0,{"$f":"AB1089-AB1088","v":0}]
[null,null,null,null,null,null,null,null,null,null,null,null,null,null,null,null,null,null,null,null,null,null,null,null,null,null,null,0]
[98,null,null,null,null,null,null,null,null,null,null,null,null,null,null,null,null,null,null,null,null,null,null,null,null,null,null,0,{"$f":"AB1091-AB1090","v":0}]
[null,null,null,null,null,null,null,null,null,null,null,null,null,null,null,null,null,null,null,null,null,null,null,null,null,null,null,0]
[99,null,{"$f":"G2434","v":"t99"},null,null,null,null,null,null,null,null,null,null,null,null,null,null,null,null,null,null,null,null,null,null,null,null,0,{"$f":"AB1093-AB1092","v":0}]
[null,null,null,null,null,null,null,null,null,null,null,null,null,null,null,null,null,null,null,null,null,null,null,null,null,null,null,0]
[99,null,null,null,null,null,null,null,null,null,null,null,null,null,null,null,null,null,null,null,null,null,null,null,null,null,null,0,{"$f":"AB1095-AB1094","v":0}]
[null,null,null,null,null,null,null,null,null,null,null,null,null,null,null,null,null,null,null,null,null,null,null,null,null,null,null,0]
[99,null,null,null,null,null,null,null,null,null,null,null,null,null,null,null,null,null,null,null,null,null,null,null,null,null,null,0,{"$f":"AB1097-AB1096","v":0}]
[null,null,null,null,null,null,null,null,null,null,null,null,null,null,null,null,null,null,null,null,null,null,null,null,null,null,null,0]
[99,null,null,null,null,null,null,null,null,null,null,null,null,null,null,null,null,null,null,null,null,null,null,null,null,null,null,0,{"$f":"AB1099-AB1098","v":0}]
[null,null,null,null,null,null,null,null,null,null,null,null,null,null,null,null,null,null,null,null,null,null,null,null,null,null,null,0]
[99,null,null,null,null,null,null,null,null,null,null,null,null,null,null,null,null,null,null,null,null,null,null,null,null,null,null,0,{"$f":"AB1101-AB1100","v":0}]
[null,null,null,null,null,null,null,null,null,null,null,null,null,null,null,null,null,null,null,null,null,null,null,null,null,null,null,0]
[99,null,null,null,null,null,null,null,null,null,null,null,null,null,null,null,null,null,null,null,null,null,null,null,null,null,null,0,{"$f":"AB1103-AB1102","v":0}]
[null,null,null,null,null,null,null,null,null,null,null,null,null,null,null,null,null,null,null,null,null,null,null,null,null,null,null,0]
[99,null,null,null,null,null,null,null,null,null,null,null,null,null,null,null,null,null,null,null,null,null,null,null,null,null,null,0,{"$f":"AB1105-AB1104","v":0}]
[null,null,null,null,null,null,null,null,null,null,null,null,null,null,null,null,null,null,null,null,null,null,null,null,null,null,null,0]
[99,null,null,null,null,null,null,null,null,null,null,null,null,null,null,null,null,null,null,null,null,null,null,null,null,null,null,0,{"$f":"AB1107-AB1106","v":0}]
[null,null,null,null,null,null,null,null,null,null,null,null,null,null,null,null,null,null,null,null,null,null,null,null,null,null,null,0]
[100,null,{"$f":"IF(G2436=\"\",\"\",G2436)","v":"t100"},null,{"$f":"IF(COUNTA(H1109:AA1109)=0,\"\",COUNTA(H1109:AA1109))","v":""},null,null,null,null,null,null,null,null,null,null,null,null,null,null,null,null,null,null,null,null,null,null,0,{"$f":"AB1109-AB1108","v":0}]
[null,null,null,null,null,null,null,null,null,null,null,null,null,null,null,null,null,null,null,null,null,null,null,null,null,null,null,0]
[100,null,null,null,{"$f":"IF(COUNTA(H1111:AA1111)=0,\"\",COUNTA(H1111:AA1111))","v":""},null,null,null,null,null,null,null,null,null,null,null,null,null,null,null,null,null,null,null,null,null,null,0,{"$f":"AB1111-AB1110","v":0}]
[null,null,null,null,null,null,null,null,null,null,null,null,null,null,null,null,null,null,null,null,null,null,null,null,null,null,null,0]
[100,null,null,null,{"$f":"IF(COUNTA(H1113:AA1113)=0,\"\",COUNTA(H1113:AA1113))","v":""},null,null,null,null,null,null,null,null,null,null,null,null,null,null,null,null,null,null,null,null,null,null,0,{"$f":"AB1113-AB1112","v":0}]
[null,null,null,null,null,null,null,null,null,null,null,null,null,null,null,null,null,null,null,null,null,null,null,null,null,null,null,0]
[100,null,null,null,{"$f":"IF(COUNTA(H1115:AA1115)=0,\"\",COUNTA(H1115:AA1115))","v":""},null,null,null,null,null,null,null,null,null,null,null,null,null,null,null,null,null,null,null,null,null,null,0,{"$f":"AB1115-AB1114","v":0}]
[null,null,null,null,null,null,null,null,null,null,null,null,null,null,null,null,null,null,null,null,null,null,null,null,null,null,null,0]
[100,null,null,null,{"$f":"IF(COUNTA(H1117:AA1117)=0,\"\",COUNTA(H1117:AA1117))","v":""},null,null,null,null,null,null,null,null,null,null,null,null,null,null,null,null,null,null,null,null,null,null,0,{"$f":"AB1117-AB1116","v":0}]
[null,null,null,null,null,null,null,null,null,null,null,null,null,null,null,null,null,null,null,null,null,null,null,null,null,null,null,0]
[100,null,null,null,{"$f":"IF(COUNTA(H1119:AA1119)=0,\"\",COUNTA(H1119:AA1119))","v":""},null,null,null,null,null,null,null,null,null,null,null,null,null,null,null,null,null,null,null,null,null,null,0,{"$f":"AB1119-AB1118","v":0}]
[null,null,null,null,null,null,null,null,null,null,null,null,null,null,null,null,null,null,null,null,null,null,null,null,null,null,null,0]
[100,null,null,null,{"$f":"IF(COUNTA(H1121:AA1121)=0,\"\",COUNTA(H1121:AA1121))","v":""},null,null,null,null,null,null,null,null,null,null,null,null,null,null,null,null,null,null,null,null,null,null,0,{"$f":"AB1121-AB1120","v":0}]
[null,null,null,null,null,null,null,null,null,null,null,null,null,null,null,null,null,null,null,null,null,null,null,null,null,null,null,0]
[100,null,null,null,{"$f":"IF(COUNTA(H1123:AA1123)=0,\"\",COUNTA(H1123:AA1123))","v":""},null,null,null,null,null,null,null,null,null,null,null,null,null,null,null,null,null,null,null,null,null,null,0,{"$f":"AB1123-AB1122","v":0}]
[null,null,null,null,null,null,null,null,null,null,null,null,null,null,null,null,null,null,null,null,null,null,null,null,null,null,null,{"$f":"COUNTA(H1124:AA1124)","v":0}]
[101,null,{"$f":"IF(G2438=\"\",\"\",G2438)","v":"杉山"},null,{"$f":"IF(COUNTA(H1125:AA1125)=0,\"\",COUNTA(H1125:AA1125))","v":""},null,null,null,null,null,null,null,null,null,null,null,null,null,null,null,null,null,null,null,null,null,null,0,{"$f":"AB1125-AB1124","v":0}]
[null,null,null,null,null,null,null,null,null,null,null,null,null,null,null,null,null,null,null,null,null,null,null,null,null,null,null,0]
[101,null,null,null,{"$f":"IF(COUNTA(H1127:AA1127)=0,\"\",COUNTA(H1127:AA1127))","v":""},null,null,null,null,null,null,null,null,null,null,null,null,null,null,null,null,null,null,null,null,null,null,0,{"$f":"AB1127-AB1126","v":0}]
[null,null,null,null,null,null,null,null,null,null,null,null,null,null,null,null,null,null,null,null,null,null,null,null,null,null,null,0]
[101,null,null,null,{"$f":"IF(COUNTA(H1129:AA1129)=0,\"\",COUNTA(H1129:AA1129))","v":""},null,null,null,null,null,null,null,null,null,null,null,null,null,null,null,null,null,null,null,null,null,null,0,{"$f":"AB1129-AB1128","v":0}]
[null,null,null,null,null,null,null,null,null,null,null,null,null,null,null,null,null,null,null,null,null,null,null,null,null,null,null,0]
[101,null,null,null,{"$f":"IF(COUNTA(H1131:AA1131)=0,\"\",COUNTA(H1131:AA1131))","v":""},null,null,null,null,null,null,null,null,null,null,null,null,null,null,null,null,null,null,null,null,null,null,0,{"$f":"AB1131-AB1130","v":0}]
[null,null,null,null,null,null,null,46,null,null,null,null,null,null,null,null,null,null,null,null,null,null,null,null,null,null,null,1]
[101," ",null,null,{"$f":"IF(COUNTA(H1133:AA1133)=0,\"\",COUNTA(H1133:AA1133))","v":1},"LHR","杉山","*17",null,null,null,null,null,null,null,null,null,null,null,null,null,null,null,null,null,null,null,1,{"$f":"AB1133-AB1132","v":0}]
[null,null,null,null,null,null,null,null,null,null,null,null,null,null,null,null,null,null,null,null,null,null,null,null,null,null,null,0]
[102,"芸",{"$f":"IF(G2440=\"\",\"\",G2440)","v":"高橋"},null,{"$f":"IF(COUNTA(H1135:AA1135)=0,\"\",COUNTA(H1135:AA1135))","v":""},null,null,null,null,null,null,null,null,null,null,null,null,null,null,null,null,null,null,null,null,null,null,0,{"$f":"AB1135-AB1134","v":0}]
[null,null,null,null,null,null,null,null,null,null,null,null,null,null,null,null,null,null,null,null,null,null,null,null,null,null,null,0]
[102,null,null,null,{"$f":"IF(COUNTA(H1137:AA1137)=0,\"\",COUNTA(H1137:AA1137))","v":""},null,null,null,null,null,null,null,null,null,null,null,null,null,null,null,null,null,null,null,null,null,null,0,{"$f":"AB1137-AB1136","v":0}]
[null,null,null,null,null,null,null,null,null,null,null,null,null,null,null,null,null,null,null,null,null,null,null,null,null,null,null,0]
[102,null,null,null,{"$f":"IF(COUNTA(H1139:AA1139)=0,\"\",COUNTA(H1139:AA1139))","v":""},null,null,null,null,null,null,null,null,null,null,null,null,null,null,null,null,null,null,null,null,null,null,0,{"$f":"AB1139-AB1138","v":0}]
[null,null,null,null,null,null,null,null,null,null,null,null,null,null,null,null,null,null,null,null,null,null,null,null,null,null,null,0]
[102,null,null,null,{"$f":"IF(COUNTA(H1141:AA1141)=0,\"\",COUNTA(H1141:AA1141))","v":""},null,null,null,null,null,null,null,null,null,null,null,null,null,null,null,null,null,null,null,null,null,null,0,{"$f":"AB1141-AB1140","v":0}]
[null,null,null,null,null,null,null,null,null,null,null,null,null,null,null,null,null,null,null,null,null,null,null,null,null,null,null,0]
[102,null,null,null,{"$f":"IF(COUNTA(H1143:AA1143)=0,\"\",COUNTA(H1143:AA1143))","v":""},null,null,null,null,null,null,null,null,null,null,null,null,null,null,null,null,null,null,null,null,null,null,0,{"$f":"AB1143-AB1142","v":0}]
[null,null,null,null,null,null,null,null,null,null,null,null,null,null,null,null,null,null,null,null,null,null,null,null,null,null,null,0]
[103," ",{"$f":"IF(G2442=\"\",\"\",G2442)","v":"後藤"},null,{"$f":"IF(COUNTA(H1145:AA1145)=0,\"\",COUNTA(H1145:AA1145))","v":""},null,null,null,null,null,null,null,null,null,null,null,null,null,null,null,null,null,null,null,null,null,null,0,{"$f":"AB1145-AB1144","v":0}]
[null,null,null,null,null,null,null,null,null,null,null,null,null,null,null,null,null,null,null,null,null,null,null,null,null,null,null,0]
[103,null,null,null,{"$f":"IF(COUNTA(H1147:AA1147)=0,\"\",COUNTA(H1147:AA1147))","v":""},null,null,null,null,null,null,null,null,null,null,null,null,null,null,null,null,null,null,null,null,null,null,0,{"$f":"AB1147-AB1146","v":0}]
[null,null,null,null,null,null,null,null,null,null,null,null,null,null,null,null,null,null,null,null,null,null,null,null,null,null,null,0]
[103,null,null,null,{"$f":"IF(COUNTA(H1149:AA1149)=0,\"\",COUNTA(H1149:AA1149))","v":""},null,null,null,null,null,null,null,null,null,null,null,null,null,null,null,null,null,null,null,null,null,null,0,{"$f":"AB1149-AB1148","v":0}]
[null,null,null,null,null,null,null,null,null,null,null,null,null,null,null,null,null,null,null,null,null,null,null,null,null,null,null,0]
[103,null,null,null,{"$f":"IF(COUNTA(H1151:AA1151)=0,\"\",COUNTA(H1151:AA1151))","v":""},null,null,null,null,null,null,null,null,null,null,null,null,null,null,null,null,null,null,null,null,null,null,0,{"$f":"AB1151-AB1150","v":0}]
[null,null,null,null,null,null,null,null,null,null,null,null,null,null,null,null,null,null,null,null,null,null,null,null,null,null,null,0]
[103," ",null,null,{"$f":"IF(COUNTA(H1153:AA1153)=0,\"\",COUNTA(H1153:AA1153))","v":""},null,null,null,null,null,null,null,null,null,null,null,null,null,null,null,null,null,null,null,null,null,null,0,{"$f":"AB1153-AB1152","v":0}]
[null,null,null,null,null,null,null,null,null,null,null,null,null,null,null,null,null,null,null,null,null,null,null,null,null,null,null,0]
[104,null,{"$f":"IF(G2444=\"\",\"\",G2444)","v":"上原"},null,{"$f":"IF(COUNTA(H1155:AA1155)=0,\"\",COUNTA(H1155:AA1155))","v":""},null,null,null,null,null,null,null,null,null,null,null,null,null,null,null,null,null,null,null,null,null,null,0,{"$f":"AB1155-AB1154","v":0}]
[null,null,null,null,null,null,null,null,null,null,null,null,null,null,null,null,null,null,null,null,null,null,null,null,null,null,null,0]
[104,null,null,null,{"$f":"IF(COUNTA(H1157:AA1157)=0,\"\",COUNTA(H1157:AA1157))","v":""},null,null,null,null,null,null,null,null,null,null,null,null,null,null,null,null,null,null,null,null,null,null,0,{"$f":"AB1157-AB1156","v":0}]
[null,null,null,null,null,null,null,null,null,null,null,null,null,null,null,null,null,null,null,null,null,null,null,null,null,null,null,0]
[104,null,null,null,{"$f":"IF(COUNTA(H1159:AA1159)=0,\"\",COUNTA(H1159:AA1159))","v":""},null,null,null,null,null,null,null,null,null,null,null,null,null,null,null,null,null,null,null,null,null,null,0,{"$f":"AB1159-AB1158","v":0}]
[null,null,null,null,null,null,null,null,null,null,null,null,null,null,null,null,null,null,null,null,null,null,null,null,null,null,null,0]
[104,null,null,null,{"$f":"IF(COUNTA(H1161:AA1161)=0,\"\",COUNTA(H1161:AA1161))","v":""},null,null,null,null,null,null,null,null,null,null,null,null,null,null,null,null,null,null,null,null,null,null,0,{"$f":"AB1161-AB1160","v":0}]
[null,null,null,null,null,null,null,null,null,null,null,null,null,null,null,null,null,null,null,null,null,null,null,null,null,null,null,0]
[104,null,null,null,{"$f":"IF(COUNTA(H1163:AA1163)=0,\"\",COUNTA(H1163:AA1163))","v":""},null,null,null,null,null,null,null,null,null,null,null,null,null,null,null,null,null,null,null,null,null,null,0,{"$f":"AB1163-AB1162","v":0}]
[null,null,null,null,null,null,null,null,null,null,null,null,null,null,null,null,null,null,null,null,null,null,null,null,null,null,null,0]
[105,null,{"$f":"IF(G2446=\"\",\"\",G2446)","v":"秦"},null,{"$f":"IF(COUNTA(H1165:AA1165)=0,\"\",COUNTA(H1165:AA1165))","v":""},null,null,null,null,null,null,null,null,null,null,null,null,null,null,null,null,null,null,null,null,null,null,0,{"$f":"AB1165-AB1164","v":0}]
[null,null,null,null,null,null,null,null,null,null,null,null,null,null,null,null,null,null,null,null,null,null,null,null,null,null,null,0]
[105,null,null,null,{"$f":"IF(COUNTA(H1167:AA1167)=0,\"\",COUNTA(H1167:AA1167))","v":""},null,null,null,null,null,null,null,null,null,null,null,null,null,null,null,null,null,null,null,null,null,null,0,{"$f":"AB1167-AB1166","v":0}]
[null,null,null,null,null,null,null,null,null,null,null,null,null,null,null,null,null,null,null,null,null,null,null,null,null,null,null,0]
[105,null,null,null,{"$f":"IF(COUNTA(H1169:AA1169)=0,\"\",COUNTA(H1169:AA1169))","v":""},null,null,null,null,null,null,null,null,null,null,null,null,null,null,null,null,null,null,null,null,null,null,0,{"$f":"AB1169-AB1168","v":0}]
[null,null,null,null,null,null,null,null,null,null,null,null,null,null,null,null,null,null,null,null,null,null,null,null,null,null,null,0]
[105,null,null,null,{"$f":"IF(COUNTA(H1171:AA1171)=0,\"\",COUNTA(H1171:AA1171))","v":""},null,null,null,null,null,null,null,null,null,null,null,null,null,null,null,null,null,null,null,null,null,null,0,{"$f":"AB1171-AB1170","v":0}]
[null,null,null,null,null,null,null,null,null,null,null,null,null,null,null,null,null,null,null,null,null,null,null,null,null,null,null,0]
[105,"術",null,null,{"$f":"IF(COUNTA(H1173:AA1173)=0,\"\",COUNTA(H1173:AA1173))","v":""},null,null,null,null,null,null,null,null,null,null,null,null,null,null,null,null,null,null,null,null,null,null,0,{"$f":"AB1173-AB1172","v":0}]
[null,null,null,null,null,null,null,null,null,null,null,null,null,null,null,null,null,null,null,null,null,null,null,null,null,null,null,0]
[106,null,{"$f":"G2448","v":"t106"},null,null,null,null,null,null,null,null,null,null,null,null,null,null,null,null,null,null,null,null,null,null,null,null,0,{"$f":"AB1175-AB1174","v":0}]
[null,null,null,null,null,null,null,null,null,null,null,null,null,null,null,null,null,null,null,null,null,null,null,null,null,null,null,0]
[106,null,null,null,null,null,null,null,null,null,null,null,null,null,null,null,null,null,null,null,null,null,null,null,null,null,null,0,{"$f":"AB1177-AB1176","v":0}]
[null,null,null,null,null,null,null,null,null,null,null,null,null,null,null,null,null,null,null,null,null,null,null,null,null,null,null,0]
[106,null,null,null,null,null,null,null,null,null,null,null,null,null,null,null,null,null,null,null,null,null,null,null,null,null,null,0,{"$f":"AB1179-AB1178","v":0}]
[null,null,null,null,null,null,null,null,null,null,null,null,null,null,null,null,null,null,null,null,null,null,null,null,null,null,null,0]
[106,null,null,null,null,null,null,null,null,null,null,null,null,null,null,null,null,null,null,null,null,null,null,null,null,null,null,0,{"$f":"AB1181-AB1180","v":0}]
[null,null,null,null,null,null,null,null,null,null,null,null,null,null,null,null,null,null,null,null,null,null,null,null,null,null,null,0]
[106,null,null,null,null,null,null,null,null,null,null,null,null,null,null,null,null,null,null,null,null,null,null,null,null,null,null,0,{"$f":"AB1183-AB1182","v":0}]
[null,null,null,null,null,null,null,null,null,null,null,null,null,null,null,null,null,null,null,null,null,null,null,null,null,null,null,0]
[107,null,{"$f":"G2450","v":"t107"},null,null,null,null,null,null,null,null,null,null,null,null,null,null,null,null,null,null,null,null,null,null,null,null,0,{"$f":"AB1185-AB1184","v":0}]
[null,null,null,null,null,null,null,null,null,null,null,null,null,null,null,null,null,null,null,null,null,null,null,null,null,null,null,0]
[107,null,null,null,null,null,null,null,null,null,null,null,null,null,null,null,null,null,null,null,null,null,null,null,null,null,null,0,{"$f":"AB1187-AB1186","v":0}]
[null,null,null,null,null,null,null,null,null,null,null,null,null,null,null,null,null,null,null,null,null,null,null,null,null,null,null,{"$f":"COUNTA(H1188:AA1188)","v":0}]
[107,null,null,null,null,null,null,null,null,null,null,null,null,null,null,null,null,null,null,null,null,null,null,null,null,null,null,0,{"$f":"AB1189-AB1188","v":0}]
[null,null,null,null,null,null,null,null,null,null,null,null,null,null,null,null,null,null,null,null,null,null,null,null,null,null,null,0]
[107,null,null,null,null,null,null,null,null,null,null,null,null,null,null,null,null,null,null,null,null,null,null,null,null,null,null,0,{"$f":"AB1191-AB1190","v":0}]
[null,null,null,null,null,null,null,null,null,null,null,null,null,null,null,null,null,null,null,null,null,null,null,null,null,null,null,0]
[107,null,null,null,null,null,null,null,null,null,null,null,null,null,null,null,null,null,null,null,null,null,null,null,null,null,null,0,{"$f":"AB1193-AB1192","v":0}]
[null,null,null,null,null,null,null,null,null,null,null,null,null,null,null,null,null,null,null,null,null,null,null,null,null,null,null,0]
[108,null,{"$f":"G2452","v":"t108"},null,null,null,null,null,null,null,null,null,null,null,null,null,null,null,null,null,null,null,null,null,null,null,null,0,{"$f":"AB1195-AB1194","v":0}]
[null,null,null,null,null,null,null,null,null,null,null,null,null,null,null,null,null,null,null,null,null,null,null,null,null,null,null,0]
[108,null,null,null,null,null,null,null,null,null,null,null,null,null,null,null,null,null,null,null,null,null,null,null,null,null,null,0,{"$f":"AB1197-AB1196","v":0}]
[null,null,null,null,null,null,null,null,null,null,null,null,null,null,null,null,null,null,null,null,null,null,null,null,null,null,null,0]
[108,null,null,null,null,null,null,null,null,null,null,null,null,null,null,null,null,null,null,null,null,null,null,null,null,null,null,0,{"$f":"AB1199-AB1198","v":0}]
[null,null,null,null,null,null,null,null,null,null,null,null,null,null,null,null,null,null,null,null,null,null,null,null,null,null,null,0]
[108,null,null,null,null,null,null,null,null,null,null,null,null,null,null,null,null,null,null,null,null,null,null,null,null,null,null,0,{"$f":"AB1201-AB1200","v":0}]
[null,null,null,null,null,null,null,null,null,null,null,null,null,null,null,null,null,null,null,null,null,null,null,null,null,null,null,0]
[108,null,null,null,null,null,null,null,null,null,null,null,null,null,null,null,null,null,null,null,null,null,null,null,null,null,null,0,{"$f":"AB1203-AB1202","v":0}]
[null,null,null,null,null,null,null,null,null,null,null,null,null,null,null,null,null,null,null,null,null,null,null,null,null,null,null,0]
[109,null,{"$f":"G2454","v":"t109"},null,null,null,null,null,null,null,null,null,null,null,null,null,null,null,null,null,null,null,null,null,null,null,null,0,{"$f":"AB1205-AB1204","v":0}]
[null,null,null,null,null,null,null,null,null,null,null,null,null,null,null,null,null,null,null,null,null,null,null,null,null,null,null,0]
[109,null,null,null,null,null,null,null,null,null,null,null,null,null,null,null,null,null,null,null,null,null,null,null,null,null,null,0,{"$f":"AB1207-AB1206","v":0}]
[null,null,null,null,null,null,null,null,null,null,null,null,null,null,null,null,null,null,null,null,null,null,null,null,null,null,null,0]
[109,null,null,null,null,null,null,null,null,null,null,null,null,null,null,null,null,null,null,null,null,null,null,null,null,null,null,0,{"$f":"AB1209-AB1208","v":0}]
[null,null,null,null,null,null,null,null,null,null,null,null,null,null,null,null,null,null,null,null,null,null,null,null,null,null,null,0]
[109,null,null,null,null,null,null,null,null,null,null,null,null,null,null,null,null,null,null,null,null,null,null,null,null,null,null,0,{"$f":"AB1211-AB1210","v":0}]
[null,null,null,null,null,null,null,null,null,null,null,null,null,null,null,null,null,null,null,null,null,null,null,null,null,null,null,0]
[109,null,null,null,null,null,null,null,null,null,null,null,null,null,null,null,null,null,null,null,null,null,null,null,null,null,null,0,{"$f":"AB1213-AB1212","v":0}]
[null,null,null,null,null,null,null,null,null,null,null,null,null,null,null,null,null,null,null,null,null,null,null,null,null,null,null,0]
[110,null,{"$f":"G2456","v":"t110"},null,null,null,null,null,null,null,null,null,null,null,null,null,null,null,null,null,null,null,null,null,null,null,null,0,{"$f":"AB1215-AB1214","v":0}]
[null,null,null,null,null,null,null,null,null,null,null,null,null,null,null,null,null,null,null,null,null,null,null,null,null,null,null,0]
[110,null,null,null,null,null,null,null,null,null,null,null,null,null,null,null,null,null,null,null,null,null,null,null,null,null,null,0,{"$f":"AB1217-AB1216","v":0}]
[null,null,null,null,null,null,null,null,null,null,null,null,null,null,null,null,null,null,null,null,null,null,null,null,null,null,null,0]
[110,null,null,null,null,null,null,null,null,null,null,null,null,null,null,null,null,null,null,null,null,null,null,null,null,null,null,0,{"$f":"AB1219-AB1218","v":0}]
[null,null,null,null,null,null,null,null,null,null,null,null,null,null,null,null,null,null,null,null,null,null,null,null,null,null,null,0]
[110,null,null,null,null,null,null,null,null,null,null,null,null,null,null,null,null,null,null,null,null,null,null,null,null,null,null,0,{"$f":"AB1221-AB1220","v":0}]
[null,null,null,null,null,null,null,null,null,null,null,null,null,null,null,null,null,null,null,null,null,null,null,null,null,null,null,0]
[110,null,null,null,null,null,null,null,null,null,null,null,null,null,null,null,null,null,null,null,null,null,null,null,null,null,null,0,{"$f":"AB1223-AB1222","v":0}]
[null,null,null,null,null,null,null,null,null,null,null,null,null,null,null,null,null,null,null,null,null,null,null,null,null,null,null,0]
[111,null,{"$f":"G2458","v":"t111"},null,null,null,null,null,null,null,null,null,null,null,null,null,null,null,null,null,null,null,null,null,null,null,null,0,{"$f":"AB1225-AB1224","v":0}]
[null,null,null,null,null,null,null,null,null,null,null,null,null,null,null,null,null,null,null,null,null,null,null,null,null,null,null,0]
[111,null,null,null,null,null,null,null,null,null,null,null,null,null,null,null,null,null,null,null,null,null,null,null,null,null,null,0,{"$f":"AB1227-AB1226","v":0}]
[null,null,null,null,null,null,null,null,null,null,null,null,null,null,null,null,null,null,null,null,null,null,null,null,null,null,null,0]
[111,null,null,null,null,null,null,null,null,null,null,null,null,null,null,null,null,null,null,null,null,null,null,null,null,null,null,0,{"$f":"AB1229-AB1228","v":0}]
[null,null,null,null,null,null,null,null,null,null,null,null,null,null,null,null,null,null,null,null,null,null,null,null,null,null,null,0]
[111,null,null,null,null,null,null,null,null,null,null,null,null,null,null,null,null,null,null,null,null,null,null,null,null,null,null,0,{"$f":"AB1231-AB1230","v":0}]
[null,null,null,null,null,null,null,null,null,null,null,null,null,null,null,null,null,null,null,null,null,null,null,null,null,null,null,0]
[111,null,null,null,null,null,null,null,null,null,null,null,null,null,null,null,null,null,null,null,null,null,null,null,null,null,null,0,{"$f":"AB1233-AB1232","v":0}]
[null,null,null,null,null,null,null,null,null,null,null,null,null,null,null,null,null,null,null,null,null,null,null,null,null,null,null,0]
[112,null,{"$f":"G2460","v":"t112"},null,null,null,null,null,null,null,null,null,null,null,null,null,null,null,null,null,null,null,null,null,null,null,null,0,{"$f":"AB1235-AB1234","v":0}]
[null,null,null,null,null,null,null,null,null,null,null,null,null,null,null,null,null,null,null,null,null,null,null,null,null,null,null,0]
[112,null,null,null,null,null,null,null,null,null,null,null,null,null,null,null,null,null,null,null,null,null,null,null,null,null,null,0,{"$f":"AB1237-AB1236","v":0}]
[null,null,null,null,null,null,null,null,null,null,null,null,null,null,null,null,null,null,null,null,null,null,null,null,null,null,null,0]
[112,null,null,null,null,null,null,null,null,null,null,null,null,null,null,null,null,null,null,null,null,null,null,null,null,null,null,0,{"$f":"AB1239-AB1238","v":0}]
[null,null,null,null,null,null,null,null,null,null,null,null,null,null,null,null,null,null,null,null,null,null,null,null,null,null,null,0]
[112,null,null,null,null,null,null,null,null,null,null,null,null,null,null,null,null,null,null,null,null,null,null,null,null,null,null,0,{"$f":"AB1241-AB1240","v":0}]
[null,null,null,null,null,null,null,null,null,null,null,null,null,null,null,null,null,null,null,null,null,null,null,null,null,null,null,0]
[112,null,null,null,null,null,null,null,null,null,null,null,null,null,null,null,null,null,null,null,null,null,null,null,null,null,null,0,{"$f":"AB1243-AB1242","v":0}]
[null,null,null,null,null,null,null,null,null,null,null,null,null,null,null,null,null,null,null,null,null,null,null,null,null,null,null,0]
[113,null,{"$f":"G2462","v":"t113"},null,null,null,null,null,null,null,null,null,null,null,null,null,null,null,null,null,null,null,null,null,null,null,null,0,{"$f":"AB1245-AB1244","v":0}]
[null,null,null,null,null,null,null,null,null,null,null,null,null,null,null,null,null,null,null,null,null,null,null,null,null,null,null,0]
[113,null,null,null,null,null,null,null,null,null,null,null,null,null,null,null,null,null,null,null,null,null,null,null,null,null,null,0,{"$f":"AB1247-AB1246","v":0}]
[null,null,null,null,null,null,null,null,null,null,null,null,null,null,null,null,null,null,null,null,null,null,null,null,null,null,null,0]
[113,null,null,null,null,null,null,null,null,null,null,null,null,null,null,null,null,null,null,null,null,null,null,null,null,null,null,0,{"$f":"AB1249-AB1248","v":0}]
[null,null,null,null,null,null,null,null,null,null,null,null,null,null,null,null,null,null,null,null,null,null,null,null,null,null,null,0]
[113,null,null,null,null,null,null,null,null,null,null,null,null,null,null,null,null,null,null,null,null,null,null,null,null,null,null,0,{"$f":"AB1251-AB1250","v":0}]
[null,null,null,null,null,null,null,null,null,null,null,null,null,null,null,null,null,null,null,null,null,null,null,null,null,null,null,{"$f":"COUNTA(H1252:AA1252)","v":0}]
[113,null,null,null,null,null,null,null,null,null,null,null,null,null,null,null,null,null,null,null,null,null,null,null,null,null,null,0,{"$f":"AB1253-AB1252","v":0}]
[null,null,null,null,null,null,null,null,null,null,null,null,null,null,null,null,null,null,null,null,null,null,null,null,null,null,null,0]
[114,null,{"$f":"G2464","v":"t114"},null,null,null,null,null,null,null,null,null,null,null,null,null,null,null,null,null,null,null,null,null,null,null,null,0,{"$f":"AB1255-AB1254","v":0}]
[null,null,null,null,null,null,null,null,null,null,null,null,null,null,null,null,null,null,null,null,null,null,null,null,null,null,null,0]
[114,null,null,null,null,null,null,null,null,null,null,null,null,null,null,null,null,null,null,null,null,null,null,null,null,null,null,0,{"$f":"AB1257-AB1256","v":0}]
[null,null,null,null,null,null,null,null,null,null,null,null,null,null,null,null,null,null,null,null,null,null,null,null,null,null,null,0]
[114,null,null,null,null,null,null,null,null,null,null,null,null,null,null,null,null,null,null,null,null,null,null,null,null,null,null,0,{"$f":"AB1259-AB1258","v":0}]
[null,null,null,null,null,null,null,null,null,null,null,null,null,null,null,null,null,null,null,null,null,null,null,null,null,null,null,0]
[114,null,null,null,null,null,null,null,null,null,null,null,null,null,null,null,null,null,null,null,null,null,null,null,null,null,null,0,{"$f":"AB1261-AB1260","v":0}]
[null,null,null,null,null,null,null,null,null,null,null,null,null,null,null,null,null,null,null,null,null,null,null,null,null,null,null,0]
[114,null,null,null,null,null,null,null,null,null,null,null,null,null,null,null,null,null,null,null,null,null,null,null,null,null,null,0,{"$f":"AB1263-AB1262","v":0}]
[null,null,null,null,null,null,null,null,null,null,null,null,null,null,null,null,null,null,null,null,null,null,null,null,null,null,null,0]
[115,null,{"$f":"G2466","v":"t115"},null,null,null,null,null,null,null,null,null,null,null,null,null,null,null,null,null,null,null,null,null,null,null,null,0,{"$f":"AB1265-AB1264","v":0}]
[null,null,null,null,null,null,null,null,null,null,null,null,null,null,null,null,null,null,null,null,null,null,null,null,null,null,null,0]
[115,null,null,null,null,null,null,null,null,null,null,null,null,null,null,null,null,null,null,null,null,null,null,null,null,null,null,0,{"$f":"AB1267-AB1266","v":0}]
[null,null,null,null,null,null,null,null,null,null,null,null,null,null,null,null,null,null,null,null,null,null,null,null,null,null,null,0]
[115,null,null,null,null,null,null,null,null,null,null,null,null,null,null,null,null,null,null,null,null,null,null,null,null,null,null,0,{"$f":"AB1269-AB1268","v":0}]
[null,null,null,null,null,null,null,null,null,null,null,null,null,null,null,null,null,null,null,null,null,null,null,null,null,null,null,0]
[115,null,null,null,null,null,null,null,null,null,null,null,null,null,null,null,null,null,null,null,null,null,null,null,null,null,null,0,{"$f":"AB1271-AB1270","v":0}]
[null,null,null,null,null,null,null,null,null,null,null,null,null,null,null,null,null,null,null,null,null,null,null,null,null,null,null,0]
[115,null,null,null,null,null,null,null,null,null,null,null,null,null,null,null,null,null,null,null,null,null,null,null,null,null,null,0,{"$f":"AB1273-AB1272","v":0}]
[null,null,null,null,null,null,null,null,null,null,null,null,null,null,null,null,null,null,null,null,null,null,null,null,null,null,null,0]
[116,null,{"$f":"G2468","v":"t116"},null,null,null,null,null,null,null,null,null,null,null,null,null,null,null,null,null,null,null,null,null,null,null,null,0,{"$f":"AB1275-AB1274","v":0}]
[null,null,null,null,null,null,null,null,null,null,null,null,null,null,null,null,null,null,null,null,null,null,null,null,null,null,null,0]
[116,null,null,null,null,null,null,null,null,null,null,null,null,null,null,null,null,null,null,null,null,null,null,null,null,null,null,0,{"$f":"AB1277-AB1276","v":0}]
[null,null,null,null,null,null,null,null,null,null,null,null,null,null,null,null,null,null,null,null,null,null,null,null,null,null,null,0]
[116,null,null,null,null,null,null,null,null,null,null,null,null,null,null,null,null,null,null,null,null,null,null,null,null,null,null,0,{"$f":"AB1279-AB1278","v":0}]
[null,null,null,null,null,null,null,null,null,null,null,null,null,null,null,null,null,null,null,null,null,null,null,null,null,null,null,0]
[116,null,null,null,null,null,null,null,null,null,null,null,null,null,null,null,null,null,null,null,null,null,null,null,null,null,null,0,{"$f":"AB1281-AB1280","v":0}]
[null,null,null,null,null,null,null,null,null,null,null,null,null,null,null,null,null,null,null,null,null,null,null,null,null,null,null,0]
[116,null,null,null,null,null,null,null,null,null,null,null,null,null,null,null,null,null,null,null,null,null,null,null,null,null,null,0,{"$f":"AB1283-AB1282","v":0}]
[null,null,null,null,null,null,null,null,null,null,null,null,null,null,null,null,null,null,null,null,null,null,null,null,null,null,null,0]
[117,null,{"$f":"G2470","v":"t117"},null,null,null,null,null,null,null,null,null,null,null,null,null,null,null,null,null,null,null,null,null,null,null,null,0,{"$f":"AB1285-AB1284","v":0}]
[null,null,null,null,null,null,null,null,null,null,null,null,null,null,null,null,null,null,null,null,null,null,null,null,null,null,null,0]
[117,null,null,null,null,null,null,null,null,null,null,null,null,null,null,null,null,null,null,null,null,null,null,null,null,null,null,0,{"$f":"AB1287-AB1286","v":0}]
[null,null,null,null,null,null,null,null,null,null,null,null,null,null,null,null,null,null,null,null,null,null,null,null,null,null,null,0]
[117,null,null,null,null,null,null,null,null,null,null,null,null,null,null,null,null,null,null,null,null,null,null,null,null,null,null,0,{"$f":"AB1289-AB1288","v":0}]
[null,null,null,null,null,null,null,null,null,null,null,null,null,null,null,null,null,null,null,null,null,null,null,null,null,null,null,0]
[117,null,null,null,null,null,null,null,null,null,null,null,null,null,null,null,null,null,null,null,null,null,null,null,null,null,null,0,{"$f":"AB1291-AB1290","v":0}]
[null,null,null,null,null,null,null,null,null,null,null,null,null,null,null,null,null,null,null,null,null,null,null,null,null,null,null,0]
[117,null,null,null,null,null,null,null,null,null,null,null,null,null,null,null,null,null,null,null,null,null,null,null,null,null,null,0,{"$f":"AB1293-AB1292","v":0}]
[null,null,null,null,null,null,null,null,null,null,null,null,null,null,null,null,null,null,null,null,null,null,null,null,null,null,null,0]
[118,null,{"$f":"G2472","v":"t118"},null,null,null,null,null,null,null,null,null,null,null,null,null,null,null,null,null,null,null,null,null,null,null,null,0,{"$f":"AB1295-AB1294","v":0}]
[null,null,null,null,null,null,null,null,null,null,null,null,null,null,null,null,null,null,null,null,null,null,null,null,null,null,null,0]
[118,null,null,null,null,null,null,null,null,null,null,null,null,null,null,null,null,null,null,null,null,null,null,null,null,null,null,0,{"$f":"AB1297-AB1296","v":0}]
[null,null,null,null,null,null,null,null,null,null,null,null,null,null,null,null,null,null,null,null,null,null,null,null,null,null,null,0]
[118,null,null,null,null,null,null,null,null,null,null,null,null,null,null,null,null,null,null,null,null,null,null,null,null,null,null,0,{"$f":"AB1299-AB1298","v":0}]
[null,null,null,null,null,null,null,null,null,null,null,null,null,null,null,null,null,null,null,null,null,null,null,null,null,null,null,0]
[118,null,null,null,null,null,null,null,null,null,null,null,null,null,null,null,null,null,null,null,null,null,null,null,null,null,null,0,{"$f":"AB1301-AB1300","v":0}]
[null,null,null,null,null,null,null,null,null,null,null,null,null,null,null,null,null,null,null,null,null,null,null,null,null,null,null,0]
[118,null,null,null,null,null,null,null,null,null,null,null,null,null,null,null,null,null,null,null,null,null,null,null,null,null,null,0,{"$f":"AB1303-AB1302","v":0}]
[null,null,null,null,null,null,null,null,null,null,null,null,null,null,null,null,null,null,null,null,null,null,null,null,null,null,null,0]
[119,null,{"$f":"G2474","v":"t119"},null,null,null,null,null,null,null,null,null,null,null,null,null,null,null,null,null,null,null,null,null,null,null,null,0,{"$f":"AB1305-AB1304","v":0}]
[null,null,null,null,null,null,null,null,null,null,null,null,null,null,null,null,null,null,null,null,null,null,null,null,null,null,null,0]
[119,null,null,null,null,null,null,null,null,null,null,null,null,null,null,null,null,null,null,null,null,null,null,null,null,null,null,0,{"$f":"AB1307-AB1306","v":0}]
[null,null,null,null,null,null,null,null,null,null,null,null,null,null,null,null,null,null,null,null,null,null,null,null,null,null,null,0]
[119,null,null,null,null,null,null,null,null,null,null,null,null,null,null,null,null,null,null,null,null,null,null,null,null,null,null,0,{"$f":"AB1309-AB1308","v":0}]
[null,null,null,null,null,null,null,null,null,null,null,null,null,null,null,null,null,null,null,null,null,null,null,null,null,null,null,0]
[119,null,null,null,null,null,null,null,null,null,null,null,null,null,null,null,null,null,null,null,null,null,null,null,null,null,null,0,{"$f":"AB1311-AB1310","v":0}]
[null,null,null,null,null,null,null,null,null,null,null,null,null,null,null,null,null,null,null,null,null,null,null,null,null,null,null,0]
[119,null,null,null,null,null,null,null,null,null,null,null,null,null,null,null,null,null,null,null,null,null,null,null,null,null,null,0,{"$f":"AB1313-AB1312","v":0}]
[null,null,null,null,null,null,null,null,null,null,null,null,null,null,null,null,null,null,null,null,null,null,null,null,null,null,null,0]
[120,null,{"$f":"IF(G2476=\"\",\"\",G2476)","v":"t120"},null,{"$f":"IF(COUNTA(H1315:AA1315)=0,\"\",COUNTA(H1315:AA1315))","v":""},null,null,null,null,null,null,null,null,null,null,null,null,null,null,null,null,null,null,null,null,null,null,0,{"$f":"AB1315-AB1314","v":0}]
[null,null,null,null,null,null,null,null,null,null,null,null,null,null,null,null,null,null,null,null,null,null,null,null,null,null,null,{"$f":"COUNTA(H1316:AA1316)","v":0}]
[120,null,null,null,{"$f":"IF(COUNTA(H1317:AA1317)=0,\"\",COUNTA(H1317:AA1317))","v":""},null,null,null,null,null,null,null,null,null,null,null,null,null,null,null,null,null,null,null,null,null,null,0,{"$f":"AB1317-AB1316","v":0}]
[null,null,null,null,null,null,null,null,null,null,null,null,null,null,null,null,null,null,null,null,null,null,null,null,null,null,null,0]
[120,null,null,null,{"$f":"IF(COUNTA(H1319:AA1319)=0,\"\",COUNTA(H1319:AA1319))","v":""},null,null,null,null,null,null,null,null,null,null,null,null,null,null,null,null,null,null,null,null,null,null,0,{"$f":"AB1319-AB1318","v":0}]
[null,null,null,null,null,null,null,null,null,null,null,null,null,null,null,null,null,null,null,null,null,null,null,null,null,null,null,0]
[120,null,null,null,{"$f":"IF(COUNTA(H1321:AA1321)=0,\"\",COUNTA(H1321:AA1321))","v":""},null,null,null,null,null,null,null,null,null,null,null,null,null,null,null,null,null,null,null,null,null,null,0,{"$f":"AB1321-AB1320","v":0}]
[null,null,null,null,null,null,null,null,null,null,null,null,null,null,null,null,null,null,null,null,null,null,null,null,null,null,null,0]
[120,null,null,null,{"$f":"IF(COUNTA(H1323:AA1323)=0,\"\",COUNTA(H1323:AA1323))","v":""},null,null,null,null,null,null,null,null,null,null,null,null,null,null,null,null,null,null,null,null,null,null,0,{"$f":"AB1323-AB1322","v":0}]
[null,null,null,null,null,null,null,61,24,13,33,62,25,55,45,22,32,52,null,null,null,null,null,null,null,null,null,11]
[121," ",{"$f":"IF(G2478=\"\",\"\",G2478)","v":"木島"},4,{"$f":"IF(COUNTA(H1325:AA1325)=0,\"\",COUNTA(H1325:AA1325))","v":12},"英Ⅰ","木島","*11","*11","*11","*11","*12","*12","*12","*12","*13","*13","*13","*13",null,null,null,null,null,null,null,null,12,{"$f":"AB1325-AB1324","v":1}]
[null,null,null,null,null,null,null,23,null,15,34,null,null,null,null,null,null,null,null,null,null,null,null,null,null,null,null,3]
[121,null,null,2,{"$f":"IF(COUNTA(H1327:AA1327)=0,\"\",COUNTA(H1327:AA1327))","v":4},"ＯＣ","木島","*15","*15","*16","*16",null,null,null,null,null,null,null,null,null,null,null,null,null,null,null,null,4,{"$f":"AB1327-AB1326","v":1}]
[null,null,null,null,null,null,null,null,null,null,null,null,null,null,null,null,null,null,null,null,null,null,null,null,null,null,null,0]
[121,null,null,null,{"$f":"IF(COUNTA(H1329:AA1329)=0,\"\",COUNTA(H1329:AA1329))","v":""},null,null,null,null,null,null,null,null,null,null,null,null,null,null,null,null,null,null,null,null,null,null,0,{"$f":"AB1329-AB1328","v":0}]
[null,null,null,null,null,null,null,null,null,null,null,null,null,null,null,null,null,null,null,null,null,null,null,null,null,null,null,0]
[121,null,null,null,{"$f":"IF(COUNTA(H1331:AA1331)=0,\"\",COUNTA(H1331:AA1331))","v":""},null,null,null,null,null,null,null,null,null,null,null,null,null,null,null,null,null,null,null,null,null,null,0,{"$f":"AB1331-AB1330","v":0}]
[null,null,null,null,null,null,null,46,null,null,null,null,null,null,null,null,null,null,null,null,null,null,null,null,null,null,null,1]
[121,null,null,null,{"$f":"IF(COUNTA(H1333:AA1333)=0,\"\",COUNTA(H1333:AA1333))","v":1},"LHR","木島","*13",null,null,null,null,null,null,null,null,null,null,null,null,null,null,null,null,null,null,null,1,{"$f":"AB1333-AB1332","v":0}]
[null,null,null,null,null,null,null,22,35,45,61,25,42,52,15,54,32,26,16,null,null,null,null,null,null,null,null,12]
[122,null,{"$f":"IF(G2480=\"\",\"\",G2480)","v":"安藤"},4,{"$f":"IF(COUNTA(H1335:AA1335)=0,\"\",COUNTA(H1335:AA1335))","v":12},"英Ⅰ","安藤","*14","*14","*14","*14","*15","*15","*15","*15","*16","*16","*16","*16",null,null,null,null,null,null,null,null,12,{"$f":"AB1335-AB1334","v":0}]
[null,null,null,null,null,null,null,23,12,44,14,null,null,null,null,null,null,null,null,null,null,null,null,null,null,null,null,4]
[122,null,null,2,{"$f":"IF(COUNTA(H1337:AA1337)=0,\"\",COUNTA(H1337:AA1337))","v":4},"ＯＣ","安藤","*17","*17","*18","*18",null,null,null,null,null,null,null,null,null,null,null,null,null,null,null,null,4,{"$f":"AB1337-AB1336","v":0}]
[null,null,null,null,null,null,null,null,null,null,null,null,null,null,null,null,null,null,null,null,null,null,null,null,null,null,null,0]
[122,null,null,null,{"$f":"IF(COUNTA(H1339:AA1339)=0,\"\",COUNTA(H1339:AA1339))","v":""},null,null,null,null,null,null,null,null,null,null,null,null,null,null,null,null,null,null,null,null,null,null,0,{"$f":"AB1339-AB1338","v":0}]
[null,null,null,null,null,null,null,null,null,null,null,null,null,null,null,null,null,null,null,null,null,null,null,null,null,null,null,0]
[122,null,null,null,{"$f":"IF(COUNTA(H1341:AA1341)=0,\"\",COUNTA(H1341:AA1341))","v":""},null,null,null,null,null,null,null,null,null,null,null,null,null,null,null,null,null,null,null,null,null,null,0,{"$f":"AB1341-AB1340","v":0}]
[null,null,null,null,null,null,null,null,null,null,null,null,null,null,null,null,null,null,null,null,null,null,null,null,null,null,null,0]
[122,null,null,null,{"$f":"IF(COUNTA(H1343:AA1343)=0,\"\",COUNTA(H1343:AA1343))","v":""},null,null,null,null,null,null,null,null,null,null,null,null,null,null,null,null,null,null,null,null,null,null,0,{"$f":"AB1343-AB1342","v":0}]
[null,null,null,null,null,null,null,35,15,51,21,14,34,42,53,null,null,null,null,null,null,null,null,null,null,null,null,8]
[123,"英",{"$f":"IF(G2482=\"\",\"\",G2482)","v":"小井川"},4,{"$f":"IF(COUNTA(H1345:AA1345)=0,\"\",COUNTA(H1345:AA1345))","v":8},"Ｗ","小井川","*33","*33","*33","*33","*36","*36","*36","*36",null,null,null,null,null,null,null,null,null,null,null,null,8,{"$f":"AB1345-AB1344","v":0}]
[null,null,null,null,null,null,null,null,null,null,null,null,null,null,null,null,null,null,null,null,null,null,null,null,null,null,null,0]
[123,null,null,null,{"$f":"IF(COUNTA(H1347:AA1347)=0,\"\",COUNTA(H1347:AA1347))","v":""},null,null,null,null,null,null,null,null,null,null,null,null,null,null,null,null,null,null,null,null,null,null,0,{"$f":"AB1347-AB1346","v":0}]
[null,null,null,null,null,null,null,null,null,null,null,null,null,null,null,null,null,null,null,null,null,null,null,null,null,null,null,0]
[123,null,null,null,{"$f":"IF(COUNTA(H1349:AA1349)=0,\"\",COUNTA(H1349:AA1349))","v":""},null,null,null,null,null,null,null,null,null,null,null,null,null,null,null,null,null,null,null,null,null,null,0,{"$f":"AB1349-AB1348","v":0}]
[null,null,null,null,null,null,null,null,null,null,null,null,null,null,null,null,null,null,null,null,null,null,null,null,null,null,null,0]
[123,null,null,null,{"$f":"IF(COUNTA(H1351:AA1351)=0,\"\",COUNTA(H1351:AA1351))","v":""},null,null,null,null,null,null,null,null,null,null,null,null,null,null,null,null,null,null,null,null,null,null,0,{"$f":"AB1351-AB1350","v":0}]
[null,null,null,null,null,null,null,null,null,null,null,null,null,null,null,null,null,null,null,null,null,null,null,null,null,null,null,0]
[123,null,null,null,{"$f":"IF(COUNTA(H1353:AA1353)=0,\"\",COUNTA(H1353:AA1353))","v":""},null,null,null,null,null,null,null,null,null,null,null,null,null,null,null,null,null,null,null,null,null,null,0,{"$f":"AB1353-AB1352","v":0}]
[null,null,null,null,null,null,null,14,34,61,41,11,42,26,52,null,null,null,null,null,null,null,null,null,null,null,null,8]
[124,null,{"$f":"IF(G2484=\"\",\"\",G2484)","v":"清水ﾀ"},4,{"$f":"IF(COUNTA(H1355:AA1355)=0,\"\",COUNTA(H1355:AA1355))","v":8},"英Ⅰ","清水ﾀ","*17","*17","*17","*17","*18","*18","*18","*18",null,null,null,null,null,null,null,null,null,null,null,null,8,{"$f":"AB1355-AB1354","v":0}]
[null,null,null,null,null,null,null,null,null,null,null,null,null,null,null,null,null,null,null,null,null,null,null,null,null,null,null,0]
[124,null,null,null,{"$f":"IF(COUNTA(H1357:AA1357)=0,\"\",COUNTA(H1357:AA1357))","v":""},null,null,null,null,null,null,null,null,null,null,null,null,null,null,null,null,null,null,null,null,null,null,0,{"$f":"AB1357-AB1356","v":0}]
[null,null,null,null,null,null,null,null,null,null,null,null,null,null,null,null,null,null,null,null,null,null,null,null,null,null,null,0]
[124,null,null,null,{"$f":"IF(COUNTA(H1359:AA1359)=0,\"\",COUNTA(H1359:AA1359))","v":""},null,null,null,null,null,null,null,null,null,null,null,null,null,null,null,null,null,null,null,null,null,null,0,{"$f":"AB1359-AB1358","v":0}]
[null,null,null,null,null,null,null,null,null,null,null,null,null,null,null,null,null,null,null,null,null,null,null,null,null,null,null,0]
[124,null,null,null,{"$f":"IF(COUNTA(H1361:AA1361)=0,\"\",COUNTA(H1361:AA1361))","v":""},null,null,null,null,null,null,null,null,null,null,null,null,null,null,null,null,null,null,null,null,null,null,0,{"$f":"AB1361-AB1360","v":0}]
[null,null,null,null,null,null,null,null,null,null,null,null,null,null,null,null,null,null,null,null,null,null,null,null,null,null,null,0]
[124,null,null,null,{"$f":"IF(COUNTA(H1363:AA1363)=0,\"\",COUNTA(H1363:AA1363))","v":""},null,null,null,null,null,null,null,null,null,null,null,null,null,null,null,null,null,null,null,null,null,null,0,{"$f":"AB1363-AB1362","v":0}]
[null,null,null,null,null,null,null,55,23,15,41,21,53,32,14,null,null,null,null,null,null,null,null,null,null,null,null,8]
[125,null,{"$f":"IF(G2486=\"\",\"\",G2486)","v":"清水ﾖ"},4,{"$f":"IF(COUNTA(H1365:AA1365)=0,\"\",COUNTA(H1365:AA1365))","v":8},"Ｒ","清水ﾖ","*34","*34","*34","*34","*35","*35","*35","*35",null,null,null,null,null,null,null,null,null,null,null,null,8,{"$f":"AB1365-AB1364","v":0}]
[null,null,null,null,null,null,null,null,null,null,null,null,null,null,null,null,null,null,null,null,null,null,null,null,null,null,null,0]
[125,null,null,null,{"$f":"IF(COUNTA(H1367:AA1367)=0,\"\",COUNTA(H1367:AA1367))","v":""},null,null,null,null,null,null,null,null,null,null,null,null,null,null,null,null,null,null,null,null,null,null,0,{"$f":"AB1367-AB1366","v":0}]
[null,null,null,null,null,null,null,null,null,null,null,null,null,null,null,null,null,null,null,null,null,null,null,null,null,null,null,0]
[125,null,null,null,{"$f":"IF(COUNTA(H1369:AA1369)=0,\"\",COUNTA(H1369:AA1369))","v":""},null,null,null,null,null,null,null,null,null,null,null,null,null,null,null,null,null,null,null,null,null,null,0,{"$f":"AB1369-AB1368","v":0}]
[null,null,null,null,null,null,null,null,null,null,null,null,null,null,null,null,null,null,null,null,null,null,null,null,null,null,null,0]
[125,null,null,null,{"$f":"IF(COUNTA(H1371:AA1371)=0,\"\",COUNTA(H1371:AA1371))","v":""},null,null,null,null,null,null,null,null,null,null,null,null,null,null,null,null,null,null,null,null,null,null,0,{"$f":"AB1371-AB1370","v":0}]
[null,null,null,null,null,null,null,null,null,null,null,null,null,null,null,null,null,null,null,null,null,null,null,null,null,null,null,0]
[125,null,null,null,{"$f":"IF(COUNTA(H1373:AA1373)=0,\"\",COUNTA(H1373:AA1373))","v":""},null,null,null,null,null,null,null,null,null,null,null,null,null,null,null,null,null,null,null,null,null,null,0,{"$f":"AB1373-AB1372","v":0}]
[null,null,null,null,null,null,null,42,53,35,62,54,34,13,null,null,null,null,null,null,null,null,null,null,null,null,null,7]
[126,null,{"$f":"IF(G2488=\"\",\"\",G2488)","v":"加藤"},4,{"$f":"IF(COUNTA(H1375:AA1375)=0,\"\",COUNTA(H1375:AA1375))","v":8},"Ｒ","加藤","*32","*32","*32","*32","*33","*33","*33","*33",null,null,null,null,null,null,null,null,null,null,null,null,8,{"$f":"AB1375-AB1374","v":1}]
[null,null,null,null,null,null,null,null,null,null,null,null,null,null,null,null,null,null,null,null,null,null,null,null,null,null,null,0]
[126,null,null,null,{"$f":"IF(COUNTA(H1377:AA1377)=0,\"\",COUNTA(H1377:AA1377))","v":""},null,null,null,null,null,null,null,null,null,null,null,null,null,null,null,null,null,null,null,null,null,null,0,{"$f":"AB1377-AB1376","v":0}]
[null,null,null,null,null,null,null,null,null,null,null,null,null,null,null,null,null,null,null,null,null,null,null,null,null,null,null,0]
[126,null,null,null,{"$f":"IF(COUNTA(H1379:AA1379)=0,\"\",COUNTA(H1379:AA1379))","v":""},null,null,null,null,null,null,null,null,null,null,null,null,null,null,null,null,null,null,null,null,null,null,0,{"$f":"AB1379-AB1378","v":0}]
[null,null,null,null,null,null,null,null,null,null,null,null,null,null,null,null,null,null,null,null,null,null,null,null,null,null,null,{"$f":"COUNTA(H1380:AA1380)","v":0}]
[126,null,null,null,{"$f":"IF(COUNTA(H1381:AA1381)=0,\"\",COUNTA(H1381:AA1381))","v":""},null,null,null,null,null,null,null,null,null,null,null,null,null,null,null,null,null,null,null,null,null,null,0,{"$f":"AB1381-AB1380","v":0}]
[null,null,null,null,null,null,null,46,null,null,null,null,null,null,null,null,null,null,null,null,null,null,null,null,null,null,null,1]
[126,null,null,null,{"$f":"IF(COUNTA(H1383:AA1383)=0,\"\",COUNTA(H1383:AA1383))","v":1},"LHR","加藤","*33",null,null,null,null,null,null,null,null,null,null,null,null,null,null,null,null,null,null,null,1,{"$f":"AB1383-AB1382","v":0}]
[null,null,null,null,null,null,null,36,22,61,54,44,25,15,62,null,null,null,null,null,null,null,null,null,null,null,null,8]
[127,null,{"$f":"IF(G2490=\"\",\"\",G2490)","v":"松田"},4,{"$f":"IF(COUNTA(H1385:AA1385)=0,\"\",COUNTA(H1385:AA1385))","v":8},"Ｒ","松田","*36","*36","*36","*36","*38","*38","*38","*38",null,null,null,null,null,null,null,null,null,null,null,null,8,{"$f":"AB1385-AB1384","v":0}]
[null,null,null,null,null,null,null,null,null,null,null,null,null,null,null,null,null,null,null,null,null,null,null,null,null,null,null,0]
[127,null,null,null,{"$f":"IF(COUNTA(H1387:AA1387)=0,\"\",COUNTA(H1387:AA1387))","v":""},null,null,null,null,null,null,null,null,null,null,null,null,null,null,null,null,null,null,null,null,null,null,0,{"$f":"AB1387-AB1386","v":0}]
[null,null,null,null,null,null,null,null,null,null,null,null,null,null,null,null,null,null,null,null,null,null,null,null,null,null,null,0]
[127,null,null,null,{"$f":"IF(COUNTA(H1389:AA1389)=0,\"\",COUNTA(H1389:AA1389))","v":""},null,null,null,null,null,null,null,null,null,null,null,null,null,null,null,null,null,null,null,null,null,null,0,{"$f":"AB1389-AB1388","v":0}]
[null,null,null,null,null,null,null,null,null,null,null,null,null,null,null,null,null,null,null,null,null,null,null,null,null,null,null,0]
[127,null,null,null,{"$f":"IF(COUNTA(H1391:AA1391)=0,\"\",COUNTA(H1391:AA1391))","v":""},null,null,null,null,null,null,null,null,null,null,null,null,null,null,null,null,null,null,null,null,null,null,0,{"$f":"AB1391-AB1390","v":0}]
[null,null,null,null,null,null,null,46,null,null,null,null,null,null,null,null,null,null,null,null,null,null,null,null,null,null,null,1]
[127," ",null,null,{"$f":"IF(COUNTA(H1393:AA1393)=0,\"\",COUNTA(H1393:AA1393))","v":1},"LHR","松田","*36",null,null,null,null,null,null,null,null,null,null,null,null,null,null,null,null,null,null,null,1,{"$f":"AB1393-AB1392","v":0}]
[null,null,null,null,null,null,null,36,15,14,61,13,26,32,null,null,null,null,null,null,null,null,null,null,null,null,null,7]
[128,null,{"$f":"IF(G2492=\"\",\"\",G2492)","v":"小林"},2,{"$f":"IF(COUNTA(H1395:AA1395)=0,\"\",COUNTA(H1395:AA1395))","v":8},"ＯＣ","小林","*11","*11","*12","*12","*13","*13","*14","*14",null,null,null,null,null,null,null,null,null,null,null,null,8,{"$f":"AB1395-AB1394","v":1}]
[null,null,null,null,null,null,null,55,25,34,44,41,62,54,23,null,null,null,null,null,null,null,null,null,null,null,null,8]
[128," ",null,4,{"$f":"IF(COUNTA(H1397:AA1397)=0,\"\",COUNTA(H1397:AA1397))","v":8},"Ｒ","小林","*31","*31","*31","*31","*37","*37","*37","*37",null,null,null,null,null,null,null,null,null,null,null,null,8,{"$f":"AB1397-AB1396","v":0}]
[null,null,null,null,null,null,null,null,null,null,null,null,null,null,null,null,null,null,null,null,null,null,null,null,null,null,null,0]
[128,null,null,null,{"$f":"IF(COUNTA(H1399:AA1399)=0,\"\",COUNTA(H1399:AA1399))","v":""},null,null,null,null,null,null,null,null,null,null,null,null,null,null,null,null,null,null,null,null,null,null,0,{"$f":"AB1399-AB1398","v":0}]
[null,null,null,null,null,null,null,null,null,null,null,null,null,null,null,null,null,null,null,null,null,null,null,null,null,null,null,0]
[128,null,null,null,{"$f":"IF(COUNTA(H1401:AA1401)=0,\"\",COUNTA(H1401:AA1401))","v":""},null,null,null,null,null,null,null,null,null,null,null,null,null,null,null,null,null,null,null,null,null,null,0,{"$f":"AB1401-AB1400","v":0}]
[null,null,null,null,null,null,null,null,null,null,null,null,null,null,null,null,null,null,null,null,null,null,null,null,null,null,null,0]
[128," ",null,null,{"$f":"IF(COUNTA(H1403:AA1403)=0,\"\",COUNTA(H1403:AA1403))","v":""},null,null,null,null,null,null,null,null,null,null,null,null,null,null,null,null,null,null,null,null,null,null,0,{"$f":"AB1403-AB1402","v":0}]
[null,null,null,null,null,null,null,35,61,51,21,null,null,null,null,null,null,null,null,null,null,null,null,null,null,null,null,4]
[129,null,{"$f":"IF(G2494=\"\",\"\",G2494)","v":"舘"},4,{"$f":"IF(COUNTA(H1405:AA1405)=0,\"\",COUNTA(H1405:AA1405))","v":4},"Ｗ","舘","*38","*38","*38","*38",null,null,null,null,null,null,null,null,null,null,null,null,null,null,null,null,4,{"$f":"AB1405-AB1404","v":0}]
[null,null,null,null,null,null,null,null,null,null,null,null,null,null,null,null,null,null,null,null,null,null,null,null,null,null,null,0]
[129,null,null,null,{"$f":"IF(COUNTA(H1407:AA1407)=0,\"\",COUNTA(H1407:AA1407))","v":""},null,null,null,null,null,null,null,null,null,null,null,null,null,null,null,null,null,null,null,null,null,null,0,{"$f":"AB1407-AB1406","v":0}]
[null,null,null,null,null,null,null,null,null,null,null,null,null,null,null,null,null,null,null,null,null,null,null,null,null,null,null,0]
[129,null,null,null,{"$f":"IF(COUNTA(H1409:AA1409)=0,\"\",COUNTA(H1409:AA1409))","v":""},null,null,null,null,null,null,null,null,null,null,null,null,null,null,null,null,null,null,null,null,null,null,0,{"$f":"AB1409-AB1408","v":0}]
[null,null,null,null,null,null,null,null,null,null,null,null,null,null,null,null,null,null,null,null,null,null,null,null,null,null,null,0]
[129," ",null,null,{"$f":"IF(COUNTA(H1411:AA1411)=0,\"\",COUNTA(H1411:AA1411))","v":""},null,null,null,null,null,null,null,null,null,null,null,null,null,null,null,null,null,null,null,null,null,null,0,{"$f":"AB1411-AB1410","v":0}]
[null,null,null,null,null,null,null,null,null,null,null,null,null,null,null,null,null,null,null,null,null,null,null,null,null,null,null,0]
[129,null,null,null,{"$f":"IF(COUNTA(H1413:AA1413)=0,\"\",COUNTA(H1413:AA1413))","v":""},null,null,null,null,null,null,null,null,null,null,null,null,null,null,null,null,null,null,null,null,null,null,0,{"$f":"AB1413-AB1412","v":0}]
[null,null,null,null,null,null,null,null,null,null,null,null,null,null,null,null,null,null,null,null,null,null,null,null,null,null,null,0]
[130,null,{"$f":"IF(G2496=\"\",\"\",G2496)","v":"t130"},null,{"$f":"IF(COUNTA(H1415:AA1415)=0,\"\",COUNTA(H1415:AA1415))","v":""},null,null,null,null,null,null,null,null,null,null,null,null,null,null,null,null,null,null,null,null,null,null,0,{"$f":"AB1415-AB1414","v":0}]
[null,null,null,null,null,null,null,null,null,null,null,null,null,null,null,null,null,null,null,null,null,null,null,null,null,null,null,0]
[130,null,null,null,{"$f":"IF(COUNTA(H1417:AA1417)=0,\"\",COUNTA(H1417:AA1417))","v":""},null,null,null,null,null,null,null,null,null,null,null,null,null,null,null,null,null,null,null,null,null,null,0,{"$f":"AB1417-AB1416","v":0}]
[null,null,null,null,null,null,null,null,null,null,null,null,null,null,null,null,null,null,null,null,null,null,null,null,null,null,null,0]
[130,null,null,null,{"$f":"IF(COUNTA(H1419:AA1419)=0,\"\",COUNTA(H1419:AA1419))","v":""},null,null,null,null,null,null,null,null,null,null,null,null,null,null,null,null,null,null,null,null,null,null,0,{"$f":"AB1419-AB1418","v":0}]
[null,null,null,null,null,null,null,null,null,null,null,null,null,null,null,null,null,null,null,null,null,null,null,null,null,null,null,0]
[130,null,null,null,{"$f":"IF(COUNTA(H1421:AA1421)=0,\"\",COUNTA(H1421:AA1421))","v":""},null,null,null,null,null,null,null,null,null,null,null,null,null,null,null,null,null,null,null,null,null,null,0,{"$f":"AB1421-AB1420","v":0}]
[null,null,null,null,null,null,null,null,null,null,null,null,null,null,null,null,null,null,null,null,null,null,null,null,null,null,null,0]
[130,"語",null,null,{"$f":"IF(COUNTA(H1423:AA1423)=0,\"\",COUNTA(H1423:AA1423))","v":""},null,null,null,null,null,null,null,null,null,null,null,null,null,null,null,null,null,null,null,null,null,null,0,{"$f":"AB1423-AB1422","v":0}]
[null,null,null,null,null,null,null,null,null,null,null,null,null,null,null,null,null,null,null,null,null,null,null,null,null,null,null,0]
[131," ",{"$f":"IF(G2498=\"\",\"\",G2498)","v":"t131"},null,{"$f":"IF(COUNTA(H1425:AA1425)=0,\"\",COUNTA(H1425:AA1425))","v":""},null,null,null,null,null,null,null,null,null,null,null,null,null,null,null,null,null,null,null,null,null,null,0,{"$f":"AB1425-AB1424","v":0}]
[null,null,null,null,null,null,null,null,null,null,null,null,null,null,null,null,null,null,null,null,null,null,null,null,null,null,null,0]
[131,null,null,null,{"$f":"IF(COUNTA(H1427:AA1427)=0,\"\",COUNTA(H1427:AA1427))","v":""},null,null,null,null,null,null,null,null,null,null,null,null,null,null,null,null,null,null,null,null,null,null,0,{"$f":"AB1427-AB1426","v":0}]
[null,null,null,null,null,null,null,null,null,null,null,null,null,null,null,null,null,null,null,null,null,null,null,null,null,null,null,0]
[131," ",null,null,{"$f":"IF(COUNTA(H1429:AA1429)=0,\"\",COUNTA(H1429:AA1429))","v":""},null,null,null,null,null,null,null,null,null,null,null,null,null,null,null,null,null,null,null,null,null,null,0,{"$f":"AB1429-AB1428","v":0}]
[null,null,null,null,null,null,null,null,null,null,null,null,null,null,null,null,null,null,null,null,null,null,null,null,null,null,null,0]
[131,null,null,null,{"$f":"IF(COUNTA(H1431:AA1431)=0,\"\",COUNTA(H1431:AA1431))","v":""},null,null,null,null,null,null,null,null,null,null,null,null,null,null,null,null,null,null,null,null,null,null,0,{"$f":"AB1431-AB1430","v":0}]
[null,null,null,null,null,null,null,null,null,null,null,null,null,null,null,null,null,null,null,null,null,null,null,null,null,null,null,0]
[131," ",null,null,{"$f":"IF(COUNTA(H1433:AA1433)=0,\"\",COUNTA(H1433:AA1433))","v":""},null,null,null,null,null,null,null,null,null,null,null,null,null,null,null,null,null,null,null,null,null,null,0,{"$f":"AB1433-AB1432","v":0}]
[null,null,null,null,null,null,null,null,null,null,null,null,null,null,null,null,null,null,null,null,null,null,null,null,null,null,null,0]
[132,null,{"$f":"IF(G2500=\"\",\"\",G2500)","v":"t132"},null,{"$f":"IF(COUNTA(H1435:AA1435)=0,\"\",COUNTA(H1435:AA1435))","v":""},null,null,null,null,null,null,null,null,null,null,null,null,null,null,null,null,null,null,null,null,null,null,0,{"$f":"AB1435-AB1434","v":0}]
[null,null,null,null,null,null,null,null,null,null,null,null,null,null,null,null,null,null,null,null,null,null,null,null,null,null,null,0]
[132,null,null,null,{"$f":"IF(COUNTA(H1437:AA1437)=0,\"\",COUNTA(H1437:AA1437))","v":""},null,null,null,null,null,null,null,null,null,null,null,null,null,null,null,null,null,null,null,null,null,null,0,{"$f":"AB1437-AB1436","v":0}]
[null,null,null,null,null,null,null,null,null,null,null,null,null,null,null,null,null,null,null,null,null,null,null,null,null,null,null,0]
[132,null,null,null,{"$f":"IF(COUNTA(H1439:AA1439)=0,\"\",COUNTA(H1439:AA1439))","v":""},null,null,null,null,null,null,null,null,null,null,null,null,null,null,null,null,null,null,null,null,null,null,0,{"$f":"AB1439-AB1438","v":0}]
[null,null,null,null,null,null,null,null,null,null,null,null,null,null,null,null,null,null,null,null,null,null,null,null,null,null,null,0]
[132,null,null,null,{"$f":"IF(COUNTA(H1441:AA1441)=0,\"\",COUNTA(H1441:AA1441))","v":""},null,null,null,null,null,null,null,null,null,null,null,null,null,null,null,null,null,null,null,null,null,null,0,{"$f":"AB1441-AB1440","v":0}]
[null,null,null,null,null,null,null,null,null,null,null,null,null,null,null,null,null,null,null,null,null,null,null,null,null,null,null,0]
[132,null,null,null,{"$f":"IF(COUNTA(H1443:AA1443)=0,\"\",COUNTA(H1443:AA1443))","v":""},null,null,null,null,null,null,null,null,null,null,null,null,null,null,null,null,null,null,null,null,null,null,0,{"$f":"AB1443-AB1442","v":0}]
[null,null,null,null,null,null,null,null,null,null,null,null,null,null,null,null,null,null,null,null,null,null,null,null,null,null,null,{"$f":"COUNTA(H1444:AA1444)","v":0}]
[133,null,{"$f":"IF(G2502=\"\",\"\",G2502)","v":"t133"},null,{"$f":"IF(COUNTA(H1445:AA1445)=0,\"\",COUNTA(H1445:AA1445))","v":""},null,null,null,null,null,null,null,null,null,null,null,null,null,null,null,null,null,null,null,null,null,null,0,{"$f":"AB1445-AB1444","v":0}]
[null,null,null,null,null,null,null,null,null,null,null,null,null,null,null,null,null,null,null,null,null,null,null,null,null,null,null,0]
[133,null,null,null,{"$f":"IF(COUNTA(H1447:AA1447)=0,\"\",COUNTA(H1447:AA1447))","v":""},null,null,null,null,null,null,null,null,null,null,null,null,null,null,null,null,null,null,null,null,null,null,0,{"$f":"AB1447-AB1446","v":0}]
[null,null,null,null,null,null,null,null,null,null,null,null,null,null,null,null,null,null,null,null,null,null,null,null,null,null,null,0]
[133,null,null,null,{"$f":"IF(COUNTA(H1449:AA1449)=0,\"\",COUNTA(H1449:AA1449))","v":""},null,null,null,null,null,null,null,null,null,null,null,null,null,null,null,null,null,null,null,null,null,null,0,{"$f":"AB1449-AB1448","v":0}]
[null,null,null,null,null,null,null,null,null,null,null,null,null,null,null,null,null,null,null,null,null,null,null,null,null,null,null,0]
[133,null,null,null,{"$f":"IF(COUNTA(H1451:AA1451)=0,\"\",COUNTA(H1451:AA1451))","v":""},null,null,null,null,null,null,null,null,null,null,null,null,null,null,null,null,null,null,null,null,null,null,0,{"$f":"AB1451-AB1450","v":0}]
[null,null,null,null,null,null,null,null,null,null,null,null,null,null,null,null,null,null,null,null,null,null,null,null,null,null,null,0]
[133,null,null,null,{"$f":"IF(COUNTA(H1453:AA1453)=0,\"\",COUNTA(H1453:AA1453))","v":""},null,null,null,null,null,null,null,null,null,null,null,null,null,null,null,null,null,null,null,null,null,null,0,{"$f":"AB1453-AB1452","v":0}]
[null,null,null,null,null,null,null,null,null,null,null,null,null,null,null,null,null,null,null,null,null,null,null,null,null,null,null,0]
[134,null,{"$f":"IF(G2504=\"\",\"\",G2504)","v":"t134"},null,{"$f":"IF(COUNTA(H1455:AA1455)=0,\"\",COUNTA(H1455:AA1455))","v":""},null,null,null,null,null,null,null,null,null,null,null,null,null,null,null,null,null,null,null,null,null,null,0,{"$f":"AB1455-AB1454","v":0}]
[null,null,null,null,null,null,null,null,null,null,null,null,null,null,null,null,null,null,null,null,null,null,null,null,null,null,null,0]
[134,null,null,null,{"$f":"IF(COUNTA(H1457:AA1457)=0,\"\",COUNTA(H1457:AA1457))","v":""},null,null,null,null,null,null,null,null,null,null,null,null,null,null,null,null,null,null,null,null,null,null,0,{"$f":"AB1457-AB1456","v":0}]
[null,null,null,null,null,null,null,null,null,null,null,null,null,null,null,null,null,null,null,null,null,null,null,null,null,null,null,0]
[134,null,null,null,{"$f":"IF(COUNTA(H1459:AA1459)=0,\"\",COUNTA(H1459:AA1459))","v":""},null,null,null,null,null,null,null,null,null,null,null,null,null,null,null,null,null,null,null,null,null,null,0,{"$f":"AB1459-AB1458","v":0}]
[null,null,null,null,null,null,null,null,null,null,null,null,null,null,null,null,null,null,null,null,null,null,null,null,null,null,null,0]
[134,null,null,null,{"$f":"IF(COUNTA(H1461:AA1461)=0,\"\",COUNTA(H1461:AA1461))","v":""},null,null,null,null,null,null,null,null,null,null,null,null,null,null,null,null,null,null,null,null,null,null,0,{"$f":"AB1461-AB1460","v":0}]
[null,null,null,null,null,null,null,null,null,null,null,null,null,null,null,null,null,null,null,null,null,null,null,null,null,null,null,0]
[134,null,null,null,{"$f":"IF(COUNTA(H1463:AA1463)=0,\"\",COUNTA(H1463:AA1463))","v":""},null,null,null,null,null,null,null,null,null,null,null,null,null,null,null,null,null,null,null,null,null,null,0,{"$f":"AB1463-AB1462","v":0}]
[null,null,null,null,null,null,null,null,null,null,null,null,null,null,null,null,null,null,null,null,null,null,null,null,null,null,null,0]
[135,null,{"$f":"G2506","v":"t135"},null,null,null,null,null,null,null,null,null,null,null,null,null,null,null,null,null,null,null,null,null,null,null,null,0,{"$f":"AB1465-AB1464","v":0}]
[null,null,null,null,null,null,null,null,null,null,null,null,null,null,null,null,null,null,null,null,null,null,null,null,null,null,null,0]
[135,null,null,null,null,null,null,null,null,null,null,null,null,null,null,null,null,null,null,null,null,null,null,null,null,null,null,0,{"$f":"AB1467-AB1466","v":0}]
[null,null,null,null,null,null,null,null,null,null,null,null,null,null,null,null,null,null,null,null,null,null,null,null,null,null,null,0]
[135,null,null,null,null,null,null,null,null,null,null,null,null,null,null,null,null,null,null,null,null,null,null,null,null,null,null,0,{"$f":"AB1469-AB1468","v":0}]
[null,null,null,null,null,null,null,null,null,null,null,null,null,null,null,null,null,null,null,null,null,null,null,null,null,null,null,0]
[135,null,null,null,null,null,null,null,null,null,null,null,null,null,null,null,null,null,null,null,null,null,null,null,null,null,null,0,{"$f":"AB1471-AB1470","v":0}]
[null,null,null,null,null,null,null,null,null,null,null,null,null,null,null,null,null,null,null,null,null,null,null,null,null,null,null,0]
[135,null,null,null,null,null,null,null,null,null,null,null,null,null,null,null,null,null,null,null,null,null,null,null,null,null,null,0,{"$f":"AB1473-AB1472","v":0}]
[null,null,null,null,null,null,null,null,null,null,null,null,null,null,null,null,null,null,null,null,null,null,null,null,null,null,null,0]
[136,null,{"$f":"G2508","v":"t136"},null,null,null,null,null,null,null,null,null,null,null,null,null,null,null,null,null,null,null,null,null,null,null,null,0,{"$f":"AB1475-AB1474","v":0}]
[null,null,null,null,null,null,null,null,null,null,null,null,null,null,null,null,null,null,null,null,null,null,null,null,null,null,null,0]
[136,null,null,null,null,null,null,null,null,null,null,null,null,null,null,null,null,null,null,null,null,null,null,null,null,null,null,0,{"$f":"AB1477-AB1476","v":0}]
[null,null,null,null,null,null,null,null,null,null,null,null,null,null,null,null,null,null,null,null,null,null,null,null,null,null,null,0]
[136,null,null,null,null,null,null,null,null,null,null,null,null,null,null,null,null,null,null,null,null,null,null,null,null,null,null,0,{"$f":"AB1479-AB1478","v":0}]
[null,null,null,null,null,null,null,null,null,null,null,null,null,null,null,null,null,null,null,null,null,null,null,null,null,null,null,0]
[136,null,null,null,null,null,null,null,null,null,null,null,null,null,null,null,null,null,null,null,null,null,null,null,null,null,null,0,{"$f":"AB1481-AB1480","v":0}]
[null,null,null,null,null,null,null,null,null,null,null,null,null,null,null,null,null,null,null,null,null,null,null,null,null,null,null,0]
[136,null,null,null,null,null,null,null,null,null,null,null,null,null,null,null,null,null,null,null,null,null,null,null,null,null,null,0,{"$f":"AB1483-AB1482","v":0}]
[null,null,null,null,null,null,null,null,null,null,null,null,null,null,null,null,null,null,null,null,null,null,null,null,null,null,null,0]
[137,null,{"$f":"G2510","v":"t137"},null,null,null,null,null,null,null,null,null,null,null,null,null,null,null,null,null,null,null,null,null,null,null,null,0,{"$f":"AB1485-AB1484","v":0}]
[null,null,null,null,null,null,null,null,null,null,null,null,null,null,null,null,null,null,null,null,null,null,null,null,null,null,null,0]
[137,null,null,null,null,null,null,null,null,null,null,null,null,null,null,null,null,null,null,null,null,null,null,null,null,null,null,0,{"$f":"AB1487-AB1486","v":0}]
[null,null,null,null,null,null,null,null,null,null,null,null,null,null,null,null,null,null,null,null,null,null,null,null,null,null,null,0]
[137,null,null,null,null,null,null,null,null,null,null,null,null,null,null,null,null,null,null,null,null,null,null,null,null,null,null,0,{"$f":"AB1489-AB1488","v":0}]
[null,null,null,null,null,null,null,null,null,null,null,null,null,null,null,null,null,null,null,null,null,null,null,null,null,null,null,0]
[137,null,null,null,null,null,null,null,null,null,null,null,null,null,null,null,null,null,null,null,null,null,null,null,null,null,null,0,{"$f":"AB1491-AB1490","v":0}]
[null,null,null,null,null,null,null,null,null,null,null,null,null,null,null,null,null,null,null,null,null,null,null,null,null,null,null,0]
[137,null,null,null,null,null,null,null,null,null,null,null,null,null,null,null,null,null,null,null,null,null,null,null,null,null,null,0,{"$f":"AB1493-AB1492","v":0}]
[null,null,null,null,null,null,null,null,null,null,null,null,null,null,null,null,null,null,null,null,null,null,null,null,null,null,null,0]
[138,null,{"$f":"G2512","v":"t138"},null,null,null,null,null,null,null,null,null,null,null,null,null,null,null,null,null,null,null,null,null,null,null,null,0,{"$f":"AB1495-AB1494","v":0}]
[null,null,null,null,null,null,null,null,null,null,null,null,null,null,null,null,null,null,null,null,null,null,null,null,null,null,null,0]
[138,null,null,null,null,null,null,null,null,null,null,null,null,null,null,null,null,null,null,null,null,null,null,null,null,null,null,0,{"$f":"AB1497-AB1496","v":0}]
[null,null,null,null,null,null,null,null,null,null,null,null,null,null,null,null,null,null,null,null,null,null,null,null,null,null,null,0]
[138,null,null,null,null,null,null,null,null,null,null,null,null,null,null,null,null,null,null,null,null,null,null,null,null,null,null,0,{"$f":"AB1499-AB1498","v":0}]
[null,null,null,null,null,null,null,null,null,null,null,null,null,null,null,null,null,null,null,null,null,null,null,null,null,null,null,0]
[138,null,null,null,null,null,null,null,null,null,null,null,null,null,null,null,null,null,null,null,null,null,null,null,null,null,null,0,{"$f":"AB1501-AB1500","v":0}]
[null,null,null,null,null,null,null,null,null,null,null,null,null,null,null,null,null,null,null,null,null,null,null,null,null,null,null,0]
[138,null,null,null,null,null,null,null,null,null,null,null,null,null,null,null,null,null,null,null,null,null,null,null,null,null,null,0,{"$f":"AB1503-AB1502","v":0}]
[null,null,null,null,null,null,null,null,null,null,null,null,null,null,null,null,null,null,null,null,null,null,null,null,null,null,null,0]
[139,null,{"$f":"G2514","v":"t139"},null,null,null,null,null,null,null,null,null,null,null,null,null,null,null,null,null,null,null,null,null,null,null,null,0,{"$f":"AB1505-AB1504","v":0}]
[null,null,null,null,null,null,null,null,null,null,null,null,null,null,null,null,null,null,null,null,null,null,null,null,null,null,null,0]
[139,null,null,null,null,null,null,null,null,null,null,null,null,null,null,null,null,null,null,null,null,null,null,null,null,null,null,0,{"$f":"AB1507-AB1506","v":0}]
[null,null,null,null,null,null,null,null,null,null,null,null,null,null,null,null,null,null,null,null,null,null,null,null,null,null,null,{"$f":"COUNTA(H1508:AA1508)","v":0}]
[139,null,null,null,null,null,null,null,null,null,null,null,null,null,null,null,null,null,null,null,null,null,null,null,null,null,null,0,{"$f":"AB1509-AB1508","v":0}]
[null,null,null,null,null,null,null,null,null,null,null,null,null,null,null,null,null,null,null,null,null,null,null,null,null,null,null,0]
[139,null,null,null,null,null,null,null,null,null,null,null,null,null,null,null,null,null,null,null,null,null,null,null,null,null,null,0,{"$f":"AB1511-AB1510","v":0}]
[null,null,null,null,null,null,null,null,null,null,null,null,null,null,null,null,null,null,null,null,null,null,null,null,null,null,null,0]
[139,null,null,null,null,null,null,null,null,null,null,null,null,null,null,null,null,null,null,null,null,null,null,null,null,null,null,0,{"$f":"AB1513-AB1512","v":0}]
[null,null,null,null,null,null,null,null,null,null,null,null,null,null,null,null,null,null,null,null,null,null,null,null,null,null,null,0]
[140,null,{"$f":"IF(G2516=\"\",\"\",G2516)","v":"t140"},null,{"$f":"IF(COUNTA(H1515:AA1515)=0,\"\",COUNTA(H1515:AA1515))","v":""},null,null,null,null,null,null,null,null,null,null,null,null,null,null,null,null,null,null,null,null,null,null,0,{"$f":"AB1515-AB1514","v":0}]
[null,null,null,null,null,null,null,null,null,null,null,null,null,null,null,null,null,null,null,null,null,null,null,null,null,null,null,0]
[140,null,null,null,{"$f":"IF(COUNTA(H1517:AA1517)=0,\"\",COUNTA(H1517:AA1517))","v":""},null,null,null,null,null,null,null,null,null,null,null,null,null,null,null,null,null,null,null,null,null,null,0,{"$f":"AB1517-AB1516","v":0}]
[null,null,null,null,null,null,null,null,null,null,null,null,null,null,null,null,null,null,null,null,null,null,null,null,null,null,null,0]
[140,null,null,null,{"$f":"IF(COUNTA(H1519:AA1519)=0,\"\",COUNTA(H1519:AA1519))","v":""},null,null,null,null,null,null,null,null,null,null,null,null,null,null,null,null,null,null,null,null,null,null,0,{"$f":"AB1519-AB1518","v":0}]
[null,null,null,null,null,null,null,null,null,null,null,null,null,null,null,null,null,null,null,null,null,null,null,null,null,null,null,0]
[140,null,null,null,{"$f":"IF(COUNTA(H1521:AA1521)=0,\"\",COUNTA(H1521:AA1521))","v":""},null,null,null,null,null,null,null,null,null,null,null,null,null,null,null,null,null,null,null,null,null,null,0,{"$f":"AB1521-AB1520","v":0}]
[null,null,null,null,null,null,null,null,null,null,null,null,null,null,null,null,null,null,null,null,null,null,null,null,null,null,null,0]
[140,null,null,null,{"$f":"IF(COUNTA(H1523:AA1523)=0,\"\",COUNTA(H1523:AA1523))","v":""},null,null,null,null,null,null,null,null,null,null,null,null,null,null,null,null,null,null,null,null,null,null,0,{"$f":"AB1523-AB1522","v":0}]
[null,null,null,null,null,null,null,null,null,null,null,null,null,null,null,null,null,null,null,null,null,null,null,null,null,null,null,0]
[141,null,{"$f":"IF(G2518=\"\",\"\",G2518)","v":"村山"},null,{"$f":"IF(COUNTA(H1525:AA1525)=0,\"\",COUNTA(H1525:AA1525))","v":""},null,null,null,null,null,null,null,null,null,null,null,null,null,null,null,null,null,null,null,null,null,null,0,{"$f":"AB1525-AB1524","v":0}]
[null,null,null,null,null,null,null,null,null,null,null,null,null,null,null,null,null,null,null,null,null,null,null,null,null,null,null,0]
[141,null,null,null,{"$f":"IF(COUNTA(H1527:AA1527)=0,\"\",COUNTA(H1527:AA1527))","v":""},null,null,null,null,null,null,null,null,null,null,null,null,null,null,null,null,null,null,null,null,null,null,0,{"$f":"AB1527-AB1526","v":0}]
[null,null,null,null,null,null,null,null,null,null,null,null,null,null,null,null,null,null,null,null,null,null,null,null,null,null,null,0]
[141,null,null,null,{"$f":"IF(COUNTA(H1529:AA1529)=0,\"\",COUNTA(H1529:AA1529))","v":""},null,null,null,null,null,null,null,null,null,null,null,null,null,null,null,null,null,null,null,null,null,null,0,{"$f":"AB1529-AB1528","v":0}]
[null,null,null,null,null,null,null,null,null,null,null,null,null,null,null,null,null,null,null,null,null,null,null,null,null,null,null,0]
[141,null,null,null,{"$f":"IF(COUNTA(H1531:AA1531)=0,\"\",COUNTA(H1531:AA1531))","v":""},null,null,null,null,null,null,null,null,null,null,null,null,null,null,null,null,null,null,null,null,null,null,0,{"$f":"AB1531-AB1530","v":0}]
[null,null,null,null,null,null,null,null,null,null,null,null,null,null,null,null,null,null,null,null,null,null,null,null,null,null,null,0]
[141,null,null,null,{"$f":"IF(COUNTA(H1533:AA1533)=0,\"\",COUNTA(H1533:AA1533))","v":""},null,null,null,null,null,null,null,null,null,null,null,null,null,null,null,null,null,null,null,null,null,null,0,{"$f":"AB1533-AB1532","v":0}]
[null,null,null,null,null,null,null,null,null,null,null,null,null,null,null,null,null,null,null,null,null,null,null,null,null,null,null,0]
[142,"家",{"$f":"IF(G2520=\"\",\"\",G2520)","v":"川崎"},null,{"$f":"IF(COUNTA(H1535:AA1535)=0,\"\",COUNTA(H1535:AA1535))","v":""},null,null,null,null,null,null,null,null,null,null,null,null,null,null,null,null,null,null,null,null,null,null,0,{"$f":"AB1535-AB1534","v":0}]
[null,null,null,null,null,null,null,null,null,null,null,null,null,null,null,null,null,null,null,null,null,null,null,null,null,null,null,0]
[142,null,null,null,{"$f":"IF(COUNTA(H1537:AA1537)=0,\"\",COUNTA(H1537:AA1537))","v":""},null,null,null,null,null,null,null,null,null,null,null,null,null,null,null,null,null,null,null,null,null,null,0,{"$f":"AB1537-AB1536","v":0}]
[null,null,null,null,null,null,null,null,null,null,null,null,null,null,null,null,null,null,null,null,null,null,null,null,null,null,null,0]
[142,null,null,null,{"$f":"IF(COUNTA(H1539:AA1539)=0,\"\",COUNTA(H1539:AA1539))","v":""},null,null,null,null,null,null,null,null,null,null,null,null,null,null,null,null,null,null,null,null,null,null,0,{"$f":"AB1539-AB1538","v":0}]
[null,null,null,null,null,null,null,null,null,null,null,null,null,null,null,null,null,null,null,null,null,null,null,null,null,null,null,0]
[142,null,null,null,{"$f":"IF(COUNTA(H1541:AA1541)=0,\"\",COUNTA(H1541:AA1541))","v":""},null,null,null,null,null,null,null,null,null,null,null,null,null,null,null,null,null,null,null,null,null,null,0,{"$f":"AB1541-AB1540","v":0}]
[null,null,null,null,null,null,null,46,null,null,null,null,null,null,null,null,null,null,null,null,null,null,null,null,null,null,null,1]
[142,null,null,null,{"$f":"IF(COUNTA(H1543:AA1543)=0,\"\",COUNTA(H1543:AA1543))","v":1},"LHR","川崎","*31",null,null,null,null,null,null,null,null,null,null,null,null,null,null,null,null,null,null,null,1,{"$f":"AB1543-AB1542","v":0}]
[null,null,null,null,null,null,null,null,null,null,null,null,null,null,null,null,null,null,null,null,null,null,null,null,null,null,null,0]
[143,null,{"$f":"IF(G2522=\"\",\"\",G2522)","v":"寺西"},null,{"$f":"IF(COUNTA(H1545:AA1545)=0,\"\",COUNTA(H1545:AA1545))","v":""},null,null,null,null,null,null,null,null,null,null,null,null,null,null,null,null,null,null,null,null,null,null,0,{"$f":"AB1545-AB1544","v":0}]
[null,null,null,null,null,null,null,null,null,null,null,null,null,null,null,null,null,null,null,null,null,null,null,null,null,null,null,0]
[143,null,null,null,{"$f":"IF(COUNTA(H1547:AA1547)=0,\"\",COUNTA(H1547:AA1547))","v":""},null,null,null,null,null,null,null,null,null,null,null,null,null,null,null,null,null,null,null,null,null,null,0,{"$f":"AB1547-AB1546","v":0}]
[null,null,null,null,null,null,null,null,null,null,null,null,null,null,null,null,null,null,null,null,null,null,null,null,null,null,null,0]
[143,null,null,null,{"$f":"IF(COUNTA(H1549:AA1549)=0,\"\",COUNTA(H1549:AA1549))","v":""},null,null,null,null,null,null,null,null,null,null,null,null,null,null,null,null,null,null,null,null,null,null,0,{"$f":"AB1549-AB1548","v":0}]
[null,null,null,null,null,null,null,null,null,null,null,null,null,null,null,null,null,null,null,null,null,null,null,null,null,null,null,0]
[143,null,null,null,{"$f":"IF(COUNTA(H1551:AA1551)=0,\"\",COUNTA(H1551:AA1551))","v":""},null,null,null,null,null,null,null,null,null,null,null,null,null,null,null,null,null,null,null,null,null,null,0,{"$f":"AB1551-AB1550","v":0}]
[null,null,null,null,null,null,null,null,null,null,null,null,null,null,null,null,null,null,null,null,null,null,null,null,null,null,null,0]
[143,null,null,null,{"$f":"IF(COUNTA(H1553:AA1553)=0,\"\",COUNTA(H1553:AA1553))","v":""},null,null,null,null,null,null,null,null,null,null,null,null,null,null,null,null,null,null,null,null,null,null,0,{"$f":"AB1553-AB1552","v":0}]
[null,null,null,null,null,null,null,null,null,null,null,null,null,null,null,null,null,null,null,null,null,null,null,null,null,null,null,0]
[144,null,{"$f":"IF(G2524=\"\",\"\",G2524)","v":"t144"},null,{"$f":"IF(COUNTA(H1555:AA1555)=0,\"\",COUNTA(H1555:AA1555))","v":""},null,null,null,null,null,null,null,null,null,null,null,null,null,null,null,null,null,null,null,null,null,null,0,{"$f":"AB1555-AB1554","v":0}]
[null,null,null,null,null,null,null,null,null,null,null,null,null,null,null,null,null,null,null,null,null,null,null,null,null,null,null,0]
[144,null,null,null,{"$f":"IF(COUNTA(H1557:AA1557)=0,\"\",COUNTA(H1557:AA1557))","v":""},null,null,null,null,null,null,null,null,null,null,null,null,null,null,null,null,null,null,null,null,null,null,0,{"$f":"AB1557-AB1556","v":0}]
[null,null,null,null,null,null,null,null,null,null,null,null,null,null,null,null,null,null,null,null,null,null,null,null,null,null,null,0]
[144,null,null,null,{"$f":"IF(COUNTA(H1559:AA1559)=0,\"\",COUNTA(H1559:AA1559))","v":""},null,null,null,null,null,null,null,null,null,null,null,null,null,null,null,null,null,null,null,null,null,null,0,{"$f":"AB1559-AB1558","v":0}]
[null,null,null,null,null,null,null,null,null,null,null,null,null,null,null,null,null,null,null,null,null,null,null,null,null,null,null,0]
[144,null,null,null,{"$f":"IF(COUNTA(H1561:AA1561)=0,\"\",COUNTA(H1561:AA1561))","v":""},null,null,null,null,null,null,null,null,null,null,null,null,null,null,null,null,null,null,null,null,null,null,0,{"$f":"AB1561-AB1560","v":0}]
[null,null,null,null,null,null,null,null,null,null,null,null,null,null,null,null,null,null,null,null,null,null,null,null,null,null,null,0]
[144,"庭",null,null,{"$f":"IF(COUNTA(H1563:AA1563)=0,\"\",COUNTA(H1563:AA1563))","v":""},null,null,null,null,null,null,null,null,null,null,null,null,null,null,null,null,null,null,null,null,null,null,0,{"$f":"AB1563-AB1562","v":0}]
[null,null,null,null,null,null,null,null,null,null,null,null,null,null,null,null,null,null,null,null,null,null,null,null,null,null,null,0]
[145,null,{"$f":"G2526","v":"t145"},null,null,null,null,null,null,null,null,null,null,null,null,null,null,null,null,null,null,null,null,null,null,null,null,0,{"$f":"AB1565-AB1564","v":0}]
[null,null,null,null,null,null,null,null,null,null,null,null,null,null,null,null,null,null,null,null,null,null,null,null,null,null,null,0]
[145,null,null,null,null,null,null,null,null,null,null,null,null,null,null,null,null,null,null,null,null,null,null,null,null,null,null,0,{"$f":"AB1567-AB1566","v":0}]
[null,null,null,null,null,null,null,null,null,null,null,null,null,null,null,null,null,null,null,null,null,null,null,null,null,null,null,0]
[145,null,null,null,null,null,null,null,null,null,null,null,null,null,null,null,null,null,null,null,null,null,null,null,null,null,null,0,{"$f":"AB1569-AB1568","v":0}]
[null,null,null,null,null,null,null,null,null,null,null,null,null,null,null,null,null,null,null,null,null,null,null,null,null,null,null,0]
[145,null,null,null,null,null,null,null,null,null,null,null,null,null,null,null,null,null,null,null,null,null,null,null,null,null,null,0,{"$f":"AB1571-AB1570","v":0}]
[null,null,null,null,null,null,null,null,null,null,null,null,null,null,null,null,null,null,null,null,null,null,null,null,null,null,null,{"$f":"COUNTA(H1572:AA1572)","v":0}]
[145,null,null,null,null,null,null,null,null,null,null,null,null,null,null,null,null,null,null,null,null,null,null,null,null,null,null,0,{"$f":"AB1573-AB1572","v":0}]
[null,null,null,null,null,null,null,null,null,null,null,null,null,null,null,null,null,null,null,null,null,null,null,null,null,null,null,0]
[146,null,{"$f":"G2528","v":"t146"},null,null,null,null,null,null,null,null,null,null,null,null,null,null,null,null,null,null,null,null,null,null,null,null,0,{"$f":"AB1575-AB1574","v":0}]
[null,null,null,null,null,null,null,null,null,null,null,null,null,null,null,null,null,null,null,null,null,null,null,null,null,null,null,0]
[146,null,null,null,null,null,null,null,null,null,null,null,null,null,null,null,null,null,null,null,null,null,null,null,null,null,null,0,{"$f":"AB1577-AB1576","v":0}]
[null,null,null,null,null,null,null,null,null,null,null,null,null,null,null,null,null,null,null,null,null,null,null,null,null,null,null,0]
[146,null,null,null,null,null,null,null,null,null,null,null,null,null,null,null,null,null,null,null,null,null,null,null,null,null,null,0,{"$f":"AB1579-AB1578","v":0}]
[null,null,null,null,null,null,null,null,null,null,null,null,null,null,null,null,null,null,null,null,null,null,null,null,null,null,null,0]
[146,null,null,null,null,null,null,null,null,null,null,null,null,null,null,null,null,null,null,null,null,null,null,null,null,null,null,0,{"$f":"AB1581-AB1580","v":0}]
[null,null,null,null,null,null,null,null,null,null,null,null,null,null,null,null,null,null,null,null,null,null,null,null,null,null,null,0]
[146,null,null,null,null,null,null,null,null,null,null,null,null,null,null,null,null,null,null,null,null,null,null,null,null,null,null,0,{"$f":"AB1583-AB1582","v":0}]
[null,null,null,null,null,null,null,null,null,null,null,null,null,null,null,null,null,null,null,null,null,null,null,null,null,null,null,0]
[147,null,{"$f":"G2530","v":"t147"},null,null,null,null,null,null,null,null,null,null,null,null,null,null,null,null,null,null,null,null,null,null,null,null,0,{"$f":"AB1585-AB1584","v":0}]
[null,null,null,null,null,null,null,null,null,null,null,null,null,null,null,null,null,null,null,null,null,null,null,null,null,null,null,0]
[147,null,null,null,null,null,null,null,null,null,null,null,null,null,null,null,null,null,null,null,null,null,null,null,null,null,null,0,{"$f":"AB1587-AB1586","v":0}]
[null,null,null,null,null,null,null,null,null,null,null,null,null,null,null,null,null,null,null,null,null,null,null,null,null,null,null,0]
[147,null,null,null,null,null,null,null,null,null,null,null,null,null,null,null,null,null,null,null,null,null,null,null,null,null,null,0,{"$f":"AB1589-AB1588","v":0}]
[null,null,null,null,null,null,null,null,null,null,null,null,null,null,null,null,null,null,null,null,null,null,null,null,null,null,null,0]
[147,null,null,null,null,null,null,null,null,null,null,null,null,null,null,null,null,null,null,null,null,null,null,null,null,null,null,0,{"$f":"AB1591-AB1590","v":0}]
[null,null,null,null,null,null,null,null,null,null,null,null,null,null,null,null,null,null,null,null,null,null,null,null,null,null,null,0]
[147,null,null,null,null,null,null,null,null,null,null,null,null,null,null,null,null,null,null,null,null,null,null,null,null,null,null,0,{"$f":"AB1593-AB1592","v":0}]
[null,null,null,null,null,null,null,null,null,null,null,null,null,null,null,null,null,null,null,null,null,null,null,null,null,null,null,0]
[148,null,{"$f":"G2532","v":"t148"},null,null,null,null,null,null,null,null,null,null,null,null,null,null,null,null,null,null,null,null,null,null,null,null,0,{"$f":"AB1595-AB1594","v":0}]
[null,null,null,null,null,null,null,null,null,null,null,null,null,null,null,null,null,null,null,null,null,null,null,null,null,null,null,0]
[148,null,null,null,null,null,null,null,null,null,null,null,null,null,null,null,null,null,null,null,null,null,null,null,null,null,null,0,{"$f":"AB1597-AB1596","v":0}]
[null,null,null,null,null,null,null,null,null,null,null,null,null,null,null,null,null,null,null,null,null,null,null,null,null,null,null,0]
[148,null,null,null,null,null,null,null,null,null,null,null,null,null,null,null,null,null,null,null,null,null,null,null,null,null,null,0,{"$f":"AB1599-AB1598","v":0}]
[null,null,null,null,null,null,null,null,null,null,null,null,null,null,null,null,null,null,null,null,null,null,null,null,null,null,null,0]
[148,null,null,null,null,null,null,null,null,null,null,null,null,null,null,null,null,null,null,null,null,null,null,null,null,null,null,0,{"$f":"AB1601-AB1600","v":0}]
[null,null,null,null,null,null,null,null,null,null,null,null,null,null,null,null,null,null,null,null,null,null,null,null,null,null,null,0]
[148,null,null,null,null,null,null,null,null,null,null,null,null,null,null,null,null,null,null,null,null,null,null,null,null,null,null,0,{"$f":"AB1603-AB1602","v":0}]
[null,null,null,null,null,null,null,null,null,null,null,null,null,null,null,null,null,null,null,null,null,null,null,null,null,null,null,0]
[149,null,{"$f":"G2534","v":"t149"},null,null,null,null,null,null,null,null,null,null,null,null,null,null,null,null,null,null,null,null,null,null,null,null,0,{"$f":"AB1605-AB1604","v":0}]
[null,null,null,null,null,null,null,null,null,null,null,null,null,null,null,null,null,null,null,null,null,null,null,null,null,null,null,0]
[149,null,null,null,null,null,null,null,null,null,null,null,null,null,null,null,null,null,null,null,null,null,null,null,null,null,null,0,{"$f":"AB1607-AB1606","v":0}]
[null,null,null,null,null,null,null,null,null,null,null,null,null,null,null,null,null,null,null,null,null,null,null,null,null,null,null,0]
[149,null,null,null,null,null,null,null,null,null,null,null,null,null,null,null,null,null,null,null,null,null,null,null,null,null,null,0,{"$f":"AB1609-AB1608","v":0}]
[null,null,null,null,null,null,null,null,null,null,null,null,null,null,null,null,null,null,null,null,null,null,null,null,null,null,null,0]
[149,null,null,null,null,null,null,null,null,null,null,null,null,null,null,null,null,null,null,null,null,null,null,null,null,null,null,0,{"$f":"AB1611-AB1610","v":0}]
[null,null,null,null,null,null,null,null,null,null,null,null,null,null,null,null,null,null,null,null,null,null,null,null,null,null,null,0]
[149,null,null,null,null,null,null,null,null,null,null,null,null,null,null,null,null,null,null,null,null,null,null,null,null,null,null,0,{"$f":"AB1613-AB1612","v":0}]
[null,null,null,null,null,null,null,null,null,null,null,null,null,null,null,null,null,null,null,null,null,null,null,null,null,null,null,0]
[150,null,{"$f":"IF(G2536=\"\",\"\",G2536)","v":"t150"},null,{"$f":"IF(COUNTA(H1615:AA1615)=0,\"\",COUNTA(H1615:AA1615))","v":""},null,null,null,null,null,null,null,null,null,null,null,null,null,null,null,null,null,null,null,null,null,null,0,{"$f":"AB1615-AB1614","v":0}]
[null,null,null,null,null,null,null,null,null,null,null,null,null,null,null,null,null,null,null,null,null,null,null,null,null,null,null,0]
[150,null,null,null,{"$f":"IF(COUNTA(H1617:AA1617)=0,\"\",COUNTA(H1617:AA1617))","v":""},null,null,null,null,null,null,null,null,null,null,null,null,null,null,null,null,null,null,null,null,null,null,0,{"$f":"AB1617-AB1616","v":0}]
[null,null,null,null,null,null,null,null,null,null,null,null,null,null,null,null,null,null,null,null,null,null,null,null,null,null,null,0]
[150,null,null,null,{"$f":"IF(COUNTA(H1619:AA1619)=0,\"\",COUNTA(H1619:AA1619))","v":""},null,null,null,null,null,null,null,null,null,null,null,null,null,null,null,null,null,null,null,null,null,null,0,{"$f":"AB1619-AB1618","v":0}]
[null,null,null,null,null,null,null,null,null,null,null,null,null,null,null,null,null,null,null,null,null,null,null,null,null,null,null,0]
[150,null,null,null,{"$f":"IF(COUNTA(H1621:AA1621)=0,\"\",COUNTA(H1621:AA1621))","v":""},null,null,null,null,null,null,null,null,null,null,null,null,null,null,null,null,null,null,null,null,null,null,0,{"$f":"AB1621-AB1620","v":0}]
[null,null,null,null,null,null,null,null,null,null,null,null,null,null,null,null,null,null,null,null,null,null,null,null,null,null,null,0]
[150,null,null,null,{"$f":"IF(COUNTA(H1623:AA1623)=0,\"\",COUNTA(H1623:AA1623))","v":""},null,null,null,null,null,null,null,null,null,null,null,null,null,null,null,null,null,null,null,null,null,null,0,{"$f":"AB1623-AB1622","v":0}]
[null,null,null,null,null,null,null,62,null,null,null,53,null,null,null,61,43,51,null,16,null,null,null,null,null,null,null,6]
[151,null,{"$f":"IF(G2538=\"\",\"\",G2538)","v":"宮木"},2,{"$f":"IF(COUNTA(H1625:AA1625)=0,\"\",COUNTA(H1625:AA1625))","v":16},"文書","宮木","*11","*11","*12","*12","*13","*13","*14","*14","*15","*15","*16","*16","*17","*17","*18","*18",null,null,null,null,16,{"$f":"AB1625-AB1624","v":10}]
[null,null,null,null,null,null,null,null,null,null,null,null,null,null,null,null,null,null,null,null,null,null,null,null,null,null,null,0]
[151,null,null,null,{"$f":"IF(COUNTA(H1627:AA1627)=0,\"\",COUNTA(H1627:AA1627))","v":""},null,null,null,null,null,null,null,null,null,null,null,null,null,null,null,null,null,null,null,null,null,null,0,{"$f":"AB1627-AB1626","v":0}]
[null,null,null,null,null,null,null,null,null,null,null,null,null,null,null,null,null,null,null,null,null,null,null,null,null,null,null,0]
[151,null,null,null,{"$f":"IF(COUNTA(H1629:AA1629)=0,\"\",COUNTA(H1629:AA1629))","v":""},null,null,null,null,null,null,null,null,null,null,null,null,null,null,null,null,null,null,null,null,null,null,0,{"$f":"AB1629-AB1628","v":0}]
[null,null,null,null,null,null,null,null,null,null,null,null,null,null,null,null,null,null,null,null,null,null,null,null,null,null,null,0]
[151,null,null,null,{"$f":"IF(COUNTA(H1631:AA1631)=0,\"\",COUNTA(H1631:AA1631))","v":""},null,null,null,null,null,null,null,null,null,null,null,null,null,null,null,null,null,null,null,null,null,null,0,{"$f":"AB1631-AB1630","v":0}]
[null,null,null,null,null,null,null,null,null,null,null,null,null,null,null,null,null,null,null,null,null,null,null,null,null,null,null,0]
[151,null,null,null,{"$f":"IF(COUNTA(H1633:AA1633)=0,\"\",COUNTA(H1633:AA1633))","v":""},null,null,null,null,null,null,null,null,null,null,null,null,null,null,null,null,null,null,null,null,null,null,0,{"$f":"AB1633-AB1632","v":0}]
[null,"情",null,null,null,null,null,null,null,null,null,null,null,null,null,null,null,null,null,null,null,null,null,null,null,null,null,0]
[152,null,{"$f":"IF(G2540=\"\",\"\",G2540)","v":"t152"},null,{"$f":"IF(COUNTA(H1635:AA1635)=0,\"\",COUNTA(H1635:AA1635))","v":""},null,null,null,null,null,null,null,null,null,null,null,null,null,null,null,null,null,null,null,null,null,null,0,{"$f":"AB1635-AB1634","v":0}]
[null,null,null,null,null,null,null,null,null,null,null,null,null,null,null,null,null,null,null,null,null,null,null,null,null,null,null,{"$f":"COUNTA(H1636:AA1636)","v":0}]
[152,null,null,null,{"$f":"IF(COUNTA(H1637:AA1637)=0,\"\",COUNTA(H1637:AA1637))","v":""},null,null,null,null,null,null,null,null,null,null,null,null,null,null,null,null,null,null,null,null,null,null,0,{"$f":"AB1637-AB1636","v":0}]
[null,null,null,null,null,null,null,null,null,null,null,null,null,null,null,null,null,null,null,null,null,null,null,null,null,null,null,0]
[152,null,null,null,{"$f":"IF(COUNTA(H1639:AA1639)=0,\"\",COUNTA(H1639:AA1639))","v":""},null,null,null,null,null,null,null,null,null,null,null,null,null,null,null,null,null,null,null,null,null,null,0,{"$f":"AB1639-AB1638","v":0}]
[null,null,null,null,null,null,null,null,null,null,null,null,null,null,null,null,null,null,null,null,null,null,null,null,null,null,null,0]
[152,null,null,null,{"$f":"IF(COUNTA(H1641:AA1641)=0,\"\",COUNTA(H1641:AA1641))","v":""},null,null,null,null,null,null,null,null,null,null,null,null,null,null,null,null,null,null,null,null,null,null,0,{"$f":"AB1641-AB1640","v":0}]
[null,null,null,null,null,null,null,null,null,null,null,null,null,null,null,null,null,null,null,null,null,null,null,null,null,null,null,0]
[152,null,null,null,{"$f":"IF(COUNTA(H1643:AA1643)=0,\"\",COUNTA(H1643:AA1643))","v":""},null,null,null,null,null,null,null,null,null,null,null,null,null,null,null,null,null,null,null,null,null,null,0,{"$f":"AB1643-AB1642","v":0}]
[null,null,null,null,null,null,null,null,null,null,null,null,null,null,null,null,null,null,null,null,null,null,null,null,null,null,null,0]
[153,null,{"$f":"IF(G2542=\"\",\"\",G2542)","v":"t153"},null,{"$f":"IF(COUNTA(H1645:AA1645)=0,\"\",COUNTA(H1645:AA1645))","v":""},null,null,null,null,null,null,null,null,null,null,null,null,null,null,null,null,null,null,null,null,null,null,0,{"$f":"AB1645-AB1644","v":0}]
[null,null,null,null,null,null,null,null,null,null,null,null,null,null,null,null,null,null,null,null,null,null,null,null,null,null,null,0]
[153,null,null,null,{"$f":"IF(COUNTA(H1647:AA1647)=0,\"\",COUNTA(H1647:AA1647))","v":""},null,null,null,null,null,null,null,null,null,null,null,null,null,null,null,null,null,null,null,null,null,null,0,{"$f":"AB1647-AB1646","v":0}]
[null,null,null,null,null,null,null,null,null,null,null,null,null,null,null,null,null,null,null,null,null,null,null,null,null,null,null,0]
[153,null,null,null,{"$f":"IF(COUNTA(H1649:AA1649)=0,\"\",COUNTA(H1649:AA1649))","v":""},null,null,null,null,null,null,null,null,null,null,null,null,null,null,null,null,null,null,null,null,null,null,0,{"$f":"AB1649-AB1648","v":0}]
[null,null,null,null,null,null,null,null,null,null,null,null,null,null,null,null,null,null,null,null,null,null,null,null,null,null,null,0]
[153,null,null,null,{"$f":"IF(COUNTA(H1651:AA1651)=0,\"\",COUNTA(H1651:AA1651))","v":""},null,null,null,null,null,null,null,null,null,null,null,null,null,null,null,null,null,null,null,null,null,null,0,{"$f":"AB1651-AB1650","v":0}]
[null,null,null,null,null,null,null,null,null,null,null,null,null,null,null,null,null,null,null,null,null,null,null,null,null,null,null,0]
[153,null,null,null,{"$f":"IF(COUNTA(H1653:AA1653)=0,\"\",COUNTA(H1653:AA1653))","v":""},null,null,null,null,null,null,null,null,null,null,null,null,null,null,null,null,null,null,null,null,null,null,0,{"$f":"AB1653-AB1652","v":0}]
[null,null,null,null,null,null,null,null,null,null,null,null,null,null,null,null,null,null,null,null,null,null,null,null,null,null,null,0]
[154,null,{"$f":"IF(G2544=\"\",\"\",G2544)","v":"t154"},null,{"$f":"IF(COUNTA(H1655:AA1655)=0,\"\",COUNTA(H1655:AA1655))","v":""},null,null,null,null,null,null,null,null,null,null,null,null,null,null,null,null,null,null,null,null,null,null,0,{"$f":"AB1655-AB1654","v":0}]
[null,null,null,null,null,null,null,null,null,null,null,null,null,null,null,null,null,null,null,null,null,null,null,null,null,null,null,0]
[154,null,null,null,{"$f":"IF(COUNTA(H1657:AA1657)=0,\"\",COUNTA(H1657:AA1657))","v":""},null,null,null,null,null,null,null,null,null,null,null,null,null,null,null,null,null,null,null,null,null,null,0,{"$f":"AB1657-AB1656","v":0}]
[null,null,null,null,null,null,null,null,null,null,null,null,null,null,null,null,null,null,null,null,null,null,null,null,null,null,null,0]
[154,null,null,null,{"$f":"IF(COUNTA(H1659:AA1659)=0,\"\",COUNTA(H1659:AA1659))","v":""},null,null,null,null,null,null,null,null,null,null,null,null,null,null,null,null,null,null,null,null,null,null,0,{"$f":"AB1659-AB1658","v":0}]
[null,null,null,null,null,null,null,null,null,null,null,null,null,null,null,null,null,null,null,null,null,null,null,null,null,null,null,0]
[154,null,null,null,{"$f":"IF(COUNTA(H1661:AA1661)=0,\"\",COUNTA(H1661:AA1661))","v":""},null,null,null,null,null,null,null,null,null,null,null,null,null,null,null,null,null,null,null,null,null,null,0,{"$f":"AB1661-AB1660","v":0}]
[null,null,null,null,null,null,null,null,null,null,null,null,null,null,null,null,null,null,null,null,null,null,null,null,null,null,null,0]
[154,"報",null,null,{"$f":"IF(COUNTA(H1663:AA1663)=0,\"\",COUNTA(H1663:AA1663))","v":""},null,null,null,null,null,null,null,null,null,null,null,null,null,null,null,null,null,null,null,null,null,null,0,{"$f":"AB1663-AB1662","v":0}]
[null,null,null,null,null,null,null,null,null,null,null,null,null,null,null,null,null,null,null,null,null,null,null,null,null,null,null,0]
[155,null,{"$f":"G2546","v":"t155"},null,null,null,null,null,null,null,null,null,null,null,null,null,null,null,null,null,null,null,null,null,null,null,null,0,{"$f":"AB1665-AB1664","v":0}]
[null,null,null,null,null,null,null,null,null,null,null,null,null,null,null,null,null,null,null,null,null,null,null,null,null,null,null,0]
[155,null,null,null,null,null,null,null,null,null,null,null,null,null,null,null,null,null,null,null,null,null,null,null,null,null,null,0,{"$f":"AB1667-AB1666","v":0}]
[null,null,null,null,null,null,null,null,null,null,null,null,null,null,null,null,null,null,null,null,null,null,null,null,null,null,null,0]
[155,null,null,null,null,null,null,null,null,null,null,null,null,null,null,null,null,null,null,null,null,null,null,null,null,null,null,0,{"$f":"AB1669-AB1668","v":0}]
[null,null,null,null,null,null,null,null,null,null,null,null,null,null,null,null,null,null,null,null,null,null,null,null,null,null,null,0]
[155,null,null,null,null,null,null,null,null,null,null,null,null,null,null,null,null,null,null,null,null,null,null,null,null,null,null,0,{"$f":"AB1671-AB1670","v":0}]
[null,null,null,null,null,null,null,null,null,null,null,null,null,null,null,null,null,null,null,null,null,null,null,null,null,null,null,0]
[155,null,null,null,null,null,null,null,null,null,null,null,null,null,null,null,null,null,null,null,null,null,null,null,null,null,null,0,{"$f":"AB1673-AB1672","v":0}]
[null,null,null,null,null,null,null,null,null,null,null,null,null,null,null,null,null,null,null,null,null,null,null,null,null,null,null,0]
[156,null,{"$f":"G2548","v":"t156"},null,null,null,null,null,null,null,null,null,null,null,null,null,null,null,null,null,null,null,null,null,null,null,null,0,{"$f":"AB1675-AB1674","v":0}]
[null,null,null,null,null,null,null,null,null,null,null,null,null,null,null,null,null,null,null,null,null,null,null,null,null,null,null,0]
[156,null,null,null,null,null,null,null,null,null,null,null,null,null,null,null,null,null,null,null,null,null,null,null,null,null,null,0,{"$f":"AB1677-AB1676","v":0}]
[null,null,null,null,null,null,null,null,null,null,null,null,null,null,null,null,null,null,null,null,null,null,null,null,null,null,null,0]
[156,null,null,null,null,null,null,null,null,null,null,null,null,null,null,null,null,null,null,null,null,null,null,null,null,null,null,0,{"$f":"AB1679-AB1678","v":0}]
[null,null,null,null,null,null,null,null,null,null,null,null,null,null,null,null,null,null,null,null,null,null,null,null,null,null,null,0]
[156,null,null,null,null,null,null,null,null,null,null,null,null,null,null,null,null,null,null,null,null,null,null,null,null,null,null,0,{"$f":"AB1681-AB1680","v":0}]
[null,null,null,null,null,null,null,null,null,null,null,null,null,null,null,null,null,null,null,null,null,null,null,null,null,null,null,0]
[156,null,null,null,null,null,null,null,null,null,null,null,null,null,null,null,null,null,null,null,null,null,null,null,null,null,null,0,{"$f":"AB1683-AB1682","v":0}]
[null,null,null,null,null,null,null,null,null,null,null,null,null,null,null,null,null,null,null,null,null,null,null,null,null,null,null,0]
[157,null,{"$f":"G2550","v":"t157"},null,null,null,null,null,null,null,null,null,null,null,null,null,null,null,null,null,null,null,null,null,null,null,null,0,{"$f":"AB1685-AB1684","v":0}]
[null,null,null,null,null,null,null,null,null,null,null,null,null,null,null,null,null,null,null,null,null,null,null,null,null,null,null,0]
[157,null,null,null,null,null,null,null,null,null,null,null,null,null,null,null,null,null,null,null,null,null,null,null,null,null,null,0,{"$f":"AB1687-AB1686","v":0}]
[null,null,null,null,null,null,null,null,null,null,null,null,null,null,null,null,null,null,null,null,null,null,null,null,null,null,null,0]
[157,null,null,null,null,null,null,null,null,null,null,null,null,null,null,null,null,null,null,null,null,null,null,null,null,null,null,0,{"$f":"AB1689-AB1688","v":0}]
[null,null,null,null,null,null,null,null,null,null,null,null,null,null,null,null,null,null,null,null,null,null,null,null,null,null,null,0]
[157,null,null,null,null,null,null,null,null,null,null,null,null,null,null,null,null,null,null,null,null,null,null,null,null,null,null,0,{"$f":"AB1691-AB1690","v":0}]
[null,null,null,null,null,null,null,null,null,null,null,null,null,null,null,null,null,null,null,null,null,null,null,null,null,null,null,0]
[157,null,null,null,null,null,null,null,null,null,null,null,null,null,null,null,null,null,null,null,null,null,null,null,null,null,null,0,{"$f":"AB1693-AB1692","v":0}]
[null,null,null,null,null,null,null,null,null,null,null,null,null,null,null,null,null,null,null,null,null,null,null,null,null,null,null,0]
[158,null,{"$f":"G2552","v":"t158"},null,null,null,null,null,null,null,null,null,null,null,null,null,null,null,null,null,null,null,null,null,null,null,null,0,{"$f":"AB1695-AB1694","v":0}]
[null,null,null,null,null,null,null,null,null,null,null,null,null,null,null,null,null,null,null,null,null,null,null,null,null,null,null,0]
[158,null,null,null,null,null,null,null,null,null,null,null,null,null,null,null,null,null,null,null,null,null,null,null,null,null,null,0,{"$f":"AB1697-AB1696","v":0}]
[null,null,null,null,null,null,null,null,null,null,null,null,null,null,null,null,null,null,null,null,null,null,null,null,null,null,null,0]
[158,null,null,null,null,null,null,null,null,null,null,null,null,null,null,null,null,null,null,null,null,null,null,null,null,null,null,0,{"$f":"AB1699-AB1698","v":0}]
[null,null,null,null,null,null,null,null,null,null,null,null,null,null,null,null,null,null,null,null,null,null,null,null,null,null,null,{"$f":"COUNTA(H1700:AA1700)","v":0}]
[158,null,null,null,null,null,null,null,null,null,null,null,null,null,null,null,null,null,null,null,null,null,null,null,null,null,null,0,{"$f":"AB1701-AB1700","v":0}]
[null,null,null,null,null,null,null,null,null,null,null,null,null,null,null,null,null,null,null,null,null,null,null,null,null,null,null,0]
[158,null,null,null,null,null,null,null,null,null,null,null,null,null,null,null,null,null,null,null,null,null,null,null,null,null,null,0,{"$f":"AB1703-AB1702","v":0}]
[null,null,null,null,null,null,null,null,null,null,null,null,null,null,null,null,null,null,null,null,null,null,null,null,null,null,null,0]
[159,null,{"$f":"G2554","v":"t159"},null,null,null,null,null,null,null,null,null,null,null,null,null,null,null,null,null,null,null,null,null,null,null,null,0,{"$f":"AB1705-AB1704","v":0}]
[null,null,null,null,null,null,null,null,null,null,null,null,null,null,null,null,null,null,null,null,null,null,null,null,null,null,null,0]
[159,null,null,null,null,null,null,null,null,null,null,null,null,null,null,null,null,null,null,null,null,null,null,null,null,null,null,0,{"$f":"AB1707-AB1706","v":0}]
[null,null,null,null,null,null,null,null,null,null,null,null,null,null,null,null,null,null,null,null,null,null,null,null,null,null,null,0]
[159,null,null,null,null,null,null,null,null,null,null,null,null,null,null,null,null,null,null,null,null,null,null,null,null,null,null,0,{"$f":"AB1709-AB1708","v":0}]
[null,null,null,null,null,null,null,null,null,null,null,null,null,null,null,null,null,null,null,null,null,null,null,null,null,null,null,0]
[159,null,null,null,null,null,null,null,null,null,null,null,null,null,null,null,null,null,null,null,null,null,null,null,null,null,null,0,{"$f":"AB1711-AB1710","v":0}]
[null,null,null,null,null,null,null,null,null,null,null,null,null,null,null,null,null,null,null,null,null,null,null,null,null,null,null,0]
[159,null,null,null,null,null,null,null,null,null,null,null,null,null,null,null,null,null,null,null,null,null,null,null,null,null,null,0,{"$f":"AB1713-AB1712","v":0}]
[null,null,null,null,null,null,null,null,null,null,null,null,null,null,null,null,null,null,null,null,null,null,null,null,null,null,null,0]
[160,null,{"$f":"IF(G2556=\"\",\"\",G2556)","v":"t160"},null,{"$f":"IF(COUNTA(H1715:AA1715)=0,\"\",COUNTA(H1715:AA1715))","v":""},null,null,null,null,null,null,null,null,null,null,null,null,null,null,null,null,null,null,null,null,null,null,0,{"$f":"AB1715-AB1714","v":0}]
[null,null,null,null,null,null,null,null,null,null,null,null,null,null,null,null,null,null,null,null,null,null,null,null,null,null,null,0]
[160,null,null,null,{"$f":"IF(COUNTA(H1717:AA1717)=0,\"\",COUNTA(H1717:AA1717))","v":""},null,null,null,null,null,null,null,null,null,null,null,null,null,null,null,null,null,null,null,null,null,null,0,{"$f":"AB1717-AB1716","v":0}]
[null,null,null,null,null,null,null,null,null,null,null,null,null,null,null,null,null,null,null,null,null,null,null,null,null,null,null,0]
[160,null,null,null,{"$f":"IF(COUNTA(H1719:AA1719)=0,\"\",COUNTA(H1719:AA1719))","v":""},null,null,null,null,null,null,null,null,null,null,null,null,null,null,null,null,null,null,null,null,null,null,0,{"$f":"AB1719-AB1718","v":0}]
[null,null,null,null,null,null,null,null,null,null,null,null,null,null,null,null,null,null,null,null,null,null,null,null,null,null,null,0]
[160,null,null,null,{"$f":"IF(COUNTA(H1721:AA1721)=0,\"\",COUNTA(H1721:AA1721))","v":""},null,null,null,null,null,null,null,null,null,null,null,null,null,null,null,null,null,null,null,null,null,null,0,{"$f":"AB1721-AB1720","v":0}]
[null,null,null,null,null,null,null,null,null,null,null,null,null,null,null,null,null,null,null,null,null,null,null,null,null,null,null,0]
[160,null,null,null,{"$f":"IF(COUNTA(H1723:AA1723)=0,\"\",COUNTA(H1723:AA1723))","v":""},null,null,null,null,null,null,null,null,null,null,null,null,null,null,null,null,null,null,null,null,null,null,0,{"$f":"AB1723-AB1722","v":0}]
[null,null,null,null,null,null,null,null,null,null,null,null,null,null,null,null,null,null,null,null,null,null,null,null,null,null,null,0]
[161,null,{"$f":"IF(G2558=\"\",\"\",G2558)","v":"t161"},null,{"$f":"IF(COUNTA(H1725:AA1725)=0,\"\",COUNTA(H1725:AA1725))","v":""},null,null,null,null,null,null,null,null,null,null,null,null,null,null,null,null,null,null,null,null,null,null,0,{"$f":"AB1725-AB1724","v":0}]
[null,null,null,null,null,null,null,null,null,null,null,null,null,null,null,null,null,null,null,null,null,null,null,null,null,null,null,0]
[161,null,null,null,{"$f":"IF(COUNTA(H1727:AA1727)=0,\"\",COUNTA(H1727:AA1727))","v":""},null,null,null,null,null,null,null,null,null,null,null,null,null,null,null,null,null,null,null,null,null,null,0,{"$f":"AB1727-AB1726","v":0}]
[null,null,null,null,null,null,null,null,null,null,null,null,null,null,null,null,null,null,null,null,null,null,null,null,null,null,null,0]
[161,null,null,null,{"$f":"IF(COUNTA(H1729:AA1729)=0,\"\",COUNTA(H1729:AA1729))","v":""},null,null,null,null,null,null,null,null,null,null,null,null,null,null,null,null,null,null,null,null,null,null,0,{"$f":"AB1729-AB1728","v":0}]
[null,null,null,null,null,null,null,null,null,null,null,null,null,null,null,null,null,null,null,null,null,null,null,null,null,null,null,0]
[161,null,null,null,{"$f":"IF(COUNTA(H1731:AA1731)=0,\"\",COUNTA(H1731:AA1731))","v":""},null,null,null,null,null,null,null,null,null,null,null,null,null,null,null,null,null,null,null,null,null,null,0,{"$f":"AB1731-AB1730","v":0}]
[null,null,null,null,null,null,null,null,null,null,null,null,null,null,null,null,null,null,null,null,null,null,null,null,null,null,null,0]
[161,null,null,null,{"$f":"IF(COUNTA(H1733:AA1733)=0,\"\",COUNTA(H1733:AA1733))","v":""},null,null,null,null,null,null,null,null,null,null,null,null,null,null,null,null,null,null,null,null,null,null,0,{"$f":"AB1733-AB1732","v":0}]
[null,null,null,null,null,null,null,null,null,null,null,null,null,null,null,null,null,null,null,null,null,null,null,null,null,null,null,0]
[162,null,{"$f":"IF(G2560=\"\",\"\",G2560)","v":"t162"},null,{"$f":"IF(COUNTA(H1735:AA1735)=0,\"\",COUNTA(H1735:AA1735))","v":""},null,null,null,null,null,null,null,null,null,null,null,null,null,null,null,null,null,null,null,null,null,null,0,{"$f":"AB1735-AB1734","v":0}]
[null,null,null,null,null,null,null,null,null,null,null,null,null,null,null,null,null,null,null,null,null,null,null,null,null,null,null,0]
[162,null,null,null,{"$f":"IF(COUNTA(H1737:AA1737)=0,\"\",COUNTA(H1737:AA1737))","v":""},null,null,null,null,null,null,null,null,null,null,null,null,null,null,null,null,null,null,null,null,null,null,0,{"$f":"AB1737-AB1736","v":0}]
[null,null,null,null,null,null,null,null,null,null,null,null,null,null,null,null,null,null,null,null,null,null,null,null,null,null,null,0]
[162,null,null,null,{"$f":"IF(COUNTA(H1739:AA1739)=0,\"\",COUNTA(H1739:AA1739))","v":""},null,null,null,null,null,null,null,null,null,null,null,null,null,null,null,null,null,null,null,null,null,null,0,{"$f":"AB1739-AB1738","v":0}]
[null,null,null,null,null,null,null,null,null,null,null,null,null,null,null,null,null,null,null,null,null,null,null,null,null,null,null,0]
[162,null,null,null,{"$f":"IF(COUNTA(H1741:AA1741)=0,\"\",COUNTA(H1741:AA1741))","v":""},null,null,null,null,null,null,null,null,null,null,null,null,null,null,null,null,null,null,null,null,null,null,0,{"$f":"AB1741-AB1740","v":0}]
[null,null,null,null,null,null,null,null,null,null,null,null,null,null,null,null,null,null,null,null,null,null,null,null,null,null,null,0]
[162,null,null,null,{"$f":"IF(COUNTA(H1743:AA1743)=0,\"\",COUNTA(H1743:AA1743))","v":""},null,null,null,null,null,null,null,null,null,null,null,null,null,null,null,null,null,null,null,null,null,null,0,{"$f":"AB1743-AB1742","v":0}]
[null,"専",null,null,null,null,null,null,null,null,null,null,null,null,null,null,null,null,null,null,null,null,null,null,null,null,null,0]
[163,null,{"$f":"IF(G2562=\"\",\"\",G2562)","v":"t163"},null,{"$f":"IF(COUNTA(H1745:AA1745)=0,\"\",COUNTA(H1745:AA1745))","v":""},null,null,null,null,null,null,null,null,null,null,null,null,null,null,null,null,null,null,null,null,null,null,0,{"$f":"AB1745-AB1744","v":0}]
[null,null,null,null,null,null,null,null,null,null,null,null,null,null,null,null,null,null,null,null,null,null,null,null,null,null,null,0]
[163,null,null,null,{"$f":"IF(COUNTA(H1747:AA1747)=0,\"\",COUNTA(H1747:AA1747))","v":""},null,null,null,null,null,null,null,null,null,null,null,null,null,null,null,null,null,null,null,null,null,null,0,{"$f":"AB1747-AB1746","v":0}]
[null,null,null,null,null,null,null,null,null,null,null,null,null,null,null,null,null,null,null,null,null,null,null,null,null,null,null,0]
[163,null,null,null,{"$f":"IF(COUNTA(H1749:AA1749)=0,\"\",COUNTA(H1749:AA1749))","v":""},null,null,null,null,null,null,null,null,null,null,null,null,null,null,null,null,null,null,null,null,null,null,0,{"$f":"AB1749-AB1748","v":0}]
[null,null,null,null,null,null,null,null,null,null,null,null,null,null,null,null,null,null,null,null,null,null,null,null,null,null,null,0]
[163,null,null,null,{"$f":"IF(COUNTA(H1751:AA1751)=0,\"\",COUNTA(H1751:AA1751))","v":""},null,null,null,null,null,null,null,null,null,null,null,null,null,null,null,null,null,null,null,null,null,null,0,{"$f":"AB1751-AB1750","v":0}]
[null,null,null,null,null,null,null,null,null,null,null,null,null,null,null,null,null,null,null,null,null,null,null,null,null,null,null,0]
[163,null,null,null,{"$f":"IF(COUNTA(H1753:AA1753)=0,\"\",COUNTA(H1753:AA1753))","v":""},null,null,null,null,null,null,null,null,null,null,null,null,null,null,null,null,null,null,null,null,null,null,0,{"$f":"AB1753-AB1752","v":0}]
[null,null,null,null,null,null,null,null,null,null,null,null,null,null,null,null,null,null,null,null,null,null,null,null,null,null,null,0]
[164,null,{"$f":"IF(G2564=\"\",\"\",G2564)","v":"t164"},null,{"$f":"IF(COUNTA(H1755:AA1755)=0,\"\",COUNTA(H1755:AA1755))","v":""},null,null,null,null,null,null,null,null,null,null,null,null,null,null,null,null,null,null,null,null,null,null,0,{"$f":"AB1755-AB1754","v":0}]
[null,null,null,null,null,null,null,null,null,null,null,null,null,null,null,null,null,null,null,null,null,null,null,null,null,null,null,0]
[164,null,null,null,{"$f":"IF(COUNTA(H1757:AA1757)=0,\"\",COUNTA(H1757:AA1757))","v":""},null,null,null,null,null,null,null,null,null,null,null,null,null,null,null,null,null,null,null,null,null,null,0,{"$f":"AB1757-AB1756","v":0}]
[null,null,null,null,null,null,null,null,null,null,null,null,null,null,null,null,null,null,null,null,null,null,null,null,null,null,null,0]
[164,null,null,null,{"$f":"IF(COUNTA(H1759:AA1759)=0,\"\",COUNTA(H1759:AA1759))","v":""},null,null,null,null,null,null,null,null,null,null,null,null,null,null,null,null,null,null,null,null,null,null,0,{"$f":"AB1759-AB1758","v":0}]
[null,null,null,null,null,null,null,null,null,null,null,null,null,null,null,null,null,null,null,null,null,null,null,null,null,null,null,0]
[164,null,null,null,{"$f":"IF(COUNTA(H1761:AA1761)=0,\"\",COUNTA(H1761:AA1761))","v":""},null,null,null,null,null,null,null,null,null,null,null,null,null,null,null,null,null,null,null,null,null,null,0,{"$f":"AB1761-AB1760","v":0}]
[null,null,null,null,null,null,null,null,null,null,null,null,null,null,null,null,null,null,null,null,null,null,null,null,null,null,null,0]
[164,null,null,null,{"$f":"IF(COUNTA(H1763:AA1763)=0,\"\",COUNTA(H1763:AA1763))","v":""},null,null,null,null,null,null,null,null,null,null,null,null,null,null,null,null,null,null,null,null,null,null,0,{"$f":"AB1763-AB1762","v":0}]
[null,null,null,null,null,null,null,null,null,null,null,null,null,null,null,null,null,null,null,null,null,null,null,null,null,null,null,{"$f":"COUNTA(H1764:AA1764)","v":0}]
[165,null,{"$f":"IF(G2566=\"\",\"\",G2566)","v":"t165"},null,{"$f":"IF(COUNTA(H1765:AA1765)=0,\"\",COUNTA(H1765:AA1765))","v":""},null,null,null,null,null,null,null,null,null,null,null,null,null,null,null,null,null,null,null,null,null,null,0,{"$f":"AB1765-AB1764","v":0}]
[null,null,null,null,null,null,null,null,null,null,null,null,null,null,null,null,null,null,null,null,null,null,null,null,null,null,null,0]
[165,null,null,null,{"$f":"IF(COUNTA(H1767:AA1767)=0,\"\",COUNTA(H1767:AA1767))","v":""},null,null,null,null,null,null,null,null,null,null,null,null,null,null,null,null,null,null,null,null,null,null,0,{"$f":"AB1767-AB1766","v":0}]
[null,null,null,null,null,null,null,null,null,null,null,null,null,null,null,null,null,null,null,null,null,null,null,null,null,null,null,0]
[165,null,null,null,{"$f":"IF(COUNTA(H1769:AA1769)=0,\"\",COUNTA(H1769:AA1769))","v":""},null,null,null,null,null,null,null,null,null,null,null,null,null,null,null,null,null,null,null,null,null,null,0,{"$f":"AB1769-AB1768","v":0}]
[null,null,null,null,null,null,null,null,null,null,null,null,null,null,null,null,null,null,null,null,null,null,null,null,null,null,null,0]
[165,null,null,null,{"$f":"IF(COUNTA(H1771:AA1771)=0,\"\",COUNTA(H1771:AA1771))","v":""},null,null,null,null,null,null,null,null,null,null,null,null,null,null,null,null,null,null,null,null,null,null,0,{"$f":"AB1771-AB1770","v":0}]
[null,null,null,null,null,null,null,null,null,null,null,null,null,null,null,null,null,null,null,null,null,null,null,null,null,null,null,0]
[165,"門",null,null,{"$f":"IF(COUNTA(H1773:AA1773)=0,\"\",COUNTA(H1773:AA1773))","v":""},null,null,null,null,null,null,null,null,null,null,null,null,null,null,null,null,null,null,null,null,null,null,0,{"$f":"AB1773-AB1772","v":0}]
[null,null,null,null,null,null,null,null,null,null,null,null,null,null,null,null,null,null,null,null,null,null,null,null,null,null,null,0]
[166,null,{"$f":"IF(G2568=\"\",\"\",G2568)","v":"t166"},null,{"$f":"IF(COUNTA(H1775:AA1775)=0,\"\",COUNTA(H1775:AA1775))","v":""},null,null,null,null,null,null,null,null,null,null,null,null,null,null,null,null,null,null,null,null,null,null,0,{"$f":"AB1775-AB1774","v":0}]
[null,null,null,null,null,null,null,null,null,null,null,null,null,null,null,null,null,null,null,null,null,null,null,null,null,null,null,0]
[166,null,null,null,{"$f":"IF(COUNTA(H1777:AA1777)=0,\"\",COUNTA(H1777:AA1777))","v":""},null,null,null,null,null,null,null,null,null,null,null,null,null,null,null,null,null,null,null,null,null,null,0,{"$f":"AB1777-AB1776","v":0}]
[null,null,null,null,null,null,null,null,null,null,null,null,null,null,null,null,null,null,null,null,null,null,null,null,null,null,null,0]
[166,null,null,null,{"$f":"IF(COUNTA(H1779:AA1779)=0,\"\",COUNTA(H1779:AA1779))","v":""},null,null,null,null,null,null,null,null,null,null,null,null,null,null,null,null,null,null,null,null,null,null,0,{"$f":"AB1779-AB1778","v":0}]
[null,null,null,null,null,null,null,null,null,null,null,null,null,null,null,null,null,null,null,null,null,null,null,null,null,null,null,0]
[166,null,null,null,{"$f":"IF(COUNTA(H1781:AA1781)=0,\"\",COUNTA(H1781:AA1781))","v":""},null,null,null,null,null,null,null,null,null,null,null,null,null,null,null,null,null,null,null,null,null,null,0,{"$f":"AB1781-AB1780","v":0}]
[null,null,null,null,null,null,null,null,null,null,null,null,null,null,null,null,null,null,null,null,null,null,null,null,null,null,null,0]
[166,null,null,null,{"$f":"IF(COUNTA(H1783:AA1783)=0,\"\",COUNTA(H1783:AA1783))","v":""},null,null,null,null,null,null,null,null,null,null,null,null,null,null,null,null,null,null,null,null,null,null,0,{"$f":"AB1783-AB1782","v":0}]
[null,null,null,null,null,null,null,null,null,null,null,null,null,null,null,null,null,null,null,null,null,null,null,null,null,null,null,0]
[167,null,{"$f":"IF(G2570=\"\",\"\",G2570)","v":"t167"},null,{"$f":"IF(COUNTA(H1785:AA1785)=0,\"\",COUNTA(H1785:AA1785))","v":""},null,null,null,null,null,null,null,null,null,null,null,null,null,null,null,null,null,null,null,null,null,null,0,{"$f":"AB1785-AB1784","v":0}]
[null,null,null,null,null,null,null,null,null,null,null,null,null,null,null,null,null,null,null,null,null,null,null,null,null,null,null,0]
[167,null,null,null,{"$f":"IF(COUNTA(H1787:AA1787)=0,\"\",COUNTA(H1787:AA1787))","v":""},null,null,null,null,null,null,null,null,null,null,null,null,null,null,null,null,null,null,null,null,null,null,0,{"$f":"AB1787-AB1786","v":0}]
[null,null,null,null,null,null,null,null,null,null,null,null,null,null,null,null,null,null,null,null,null,null,null,null,null,null,null,0]
[167,null,null,null,{"$f":"IF(COUNTA(H1789:AA1789)=0,\"\",COUNTA(H1789:AA1789))","v":""},null,null,null,null,null,null,null,null,null,null,null,null,null,null,null,null,null,null,null,null,null,null,0,{"$f":"AB1789-AB1788","v":0}]
[null,null,null,null,null,null,null,null,null,null,null,null,null,null,null,null,null,null,null,null,null,null,null,null,null,null,null,0]
[167,null,null,null,{"$f":"IF(COUNTA(H1791:AA1791)=0,\"\",COUNTA(H1791:AA1791))","v":""},null,null,null,null,null,null,null,null,null,null,null,null,null,null,null,null,null,null,null,null,null,null,0,{"$f":"AB1791-AB1790","v":0}]
[null,null,null,null,null,null,null,null,null,null,null,null,null,null,null,null,null,null,null,null,null,null,null,null,null,null,null,0]
[167,null,null,null,{"$f":"IF(COUNTA(H1793:AA1793)=0,\"\",COUNTA(H1793:AA1793))","v":""},null,null,null,null,null,null,null,null,null,null,null,null,null,null,null,null,null,null,null,null,null,null,0,{"$f":"AB1793-AB1792","v":0}]
[null,null,null,null,null,null,null,null,null,null,null,null,null,null,null,null,null,null,null,null,null,null,null,null,null,null,null,0]
[168,null,{"$f":"IF(G2572=\"\",\"\",G2572)","v":"t168"},null,{"$f":"IF(COUNTA(H1795:AA1795)=0,\"\",COUNTA(H1795:AA1795))","v":""},null,null,null,null,null,null,null,null,null,null,null,null,null,null,null,null,null,null,null,null,null,null,0,{"$f":"AB1795-AB1794","v":0}]
[null,null,null,null,null,null,null,null,null,null,null,null,null,null,null,null,null,null,null,null,null,null,null,null,null,null,null,0]
[168,null,null,null,{"$f":"IF(COUNTA(H1797:AA1797)=0,\"\",COUNTA(H1797:AA1797))","v":""},null,null,null,null,null,null,null,null,null,null,null,null,null,null,null,null,null,null,null,null,null,null,0,{"$f":"AB1797-AB1796","v":0}]
[null,null,null,null,null,null,null,null,null,null,null,null,null,null,null,null,null,null,null,null,null,null,null,null,null,null,null,0]
[168,null,null,null,{"$f":"IF(COUNTA(H1799:AA1799)=0,\"\",COUNTA(H1799:AA1799))","v":""},null,null,null,null,null,null,null,null,null,null,null,null,null,null,null,null,null,null,null,null,null,null,0,{"$f":"AB1799-AB1798","v":0}]
[null,null,null,null,null,null,null,null,null,null,null,null,null,null,null,null,null,null,null,null,null,null,null,null,null,null,null,0]
[168,null,null,null,{"$f":"IF(COUNTA(H1801:AA1801)=0,\"\",COUNTA(H1801:AA1801))","v":""},null,null,null,null,null,null,null,null,null,null,null,null,null,null,null,null,null,null,null,null,null,null,0,{"$f":"AB1801-AB1800","v":0}]
[null,null,null,null,null,null,null,null,null,null,null,null,null,null,null,null,null,null,null,null,null,null,null,null,null,null,null,0]
[168,"１",null,null,{"$f":"IF(COUNTA(H1803:AA1803)=0,\"\",COUNTA(H1803:AA1803))","v":""},null,null,null,null,null,null,null,null,null,null,null,null,null,null,null,null,null,null,null,null,null,null,0,{"$f":"AB1803-AB1802","v":0}]
[null,null,null,null,null,null,null,null,null,null,null,null,null,null,null,null,null,null,null,null,null,null,null,null,null,null,null,0]
[169,null,{"$f":"IF(G2574=\"\",\"\",G2574)","v":"t169"},null,{"$f":"IF(COUNTA(H1805:AA1805)=0,\"\",COUNTA(H1805:AA1805))","v":""},null,null,null,null,null,null,null,null,null,null,null,null,null,null,null,null,null,null,null,null,null,null,0,{"$f":"AB1805-AB1804","v":0}]
[null,null,null,null,null,null,null,null,null,null,null,null,null,null,null,null,null,null,null,null,null,null,null,null,null,null,null,0]
[169,null,null,null,{"$f":"IF(COUNTA(H1807:AA1807)=0,\"\",COUNTA(H1807:AA1807))","v":""},null,null,null,null,null,null,null,null,null,null,null,null,null,null,null,null,null,null,null,null,null,null,0,{"$f":"AB1807-AB1806","v":0}]
[null,null,null,null,null,null,null,null,null,null,null,null,null,null,null,null,null,null,null,null,null,null,null,null,null,null,null,0]
[169,null,null,null,{"$f":"IF(COUNTA(H1809:AA1809)=0,\"\",COUNTA(H1809:AA1809))","v":""},null,null,null,null,null,null,null,null,null,null,null,null,null,null,null,null,null,null,null,null,null,null,0,{"$f":"AB1809-AB1808","v":0}]
[null,null,null,null,null,null,null,null,null,null,null,null,null,null,null,null,null,null,null,null,null,null,null,null,null,null,null,0]
[169,null,null,null,{"$f":"IF(COUNTA(H1811:AA1811)=0,\"\",COUNTA(H1811:AA1811))","v":""},null,null,null,null,null,null,null,null,null,null,null,null,null,null,null,null,null,null,null,null,null,null,0,{"$f":"AB1811-AB1810","v":0}]
[null,null,null,null,null,null,null,null,null,null,null,null,null,null,null,null,null,null,null,null,null,null,null,null,null,null,null,0]
[169,null,null,null,{"$f":"IF(COUNTA(H1813:AA1813)=0,\"\",COUNTA(H1813:AA1813))","v":""},null,null,null,null,null,null,null,null,null,null,null,null,null,null,null,null,null,null,null,null,null,null,0,{"$f":"AB1813-AB1812","v":0}]
[null,null,null,null,null,null,null,null,null,null,null,null,null,null,null,null,null,null,null,null,null,null,null,null,null,null,null,0]
[170,null,{"$f":"IF(G2576=\"\",\"\",G2576)","v":"t170"},null,{"$f":"IF(COUNTA(H1815:AA1815)=0,\"\",COUNTA(H1815:AA1815))","v":""},null,null,null,null,null,null,null,null,null,null,null,null,null,null,null,null,null,null,null,null,null,null,0,{"$f":"AB1815-AB1814","v":0}]
[null,null,null,null,null,null,null,null,null,null,null,null,null,null,null,null,null,null,null,null,null,null,null,null,null,null,null,0]
[170,null,null,null,{"$f":"IF(COUNTA(H1817:AA1817)=0,\"\",COUNTA(H1817:AA1817))","v":""},null,null,null,null,null,null,null,null,null,null,null,null,null,null,null,null,null,null,null,null,null,null,0,{"$f":"AB1817-AB1816","v":0}]
[null,null,null,null,null,null,null,null,null,null,null,null,null,null,null,null,null,null,null,null,null,null,null,null,null,null,null,0]
[170,null,null,null,{"$f":"IF(COUNTA(H1819:AA1819)=0,\"\",COUNTA(H1819:AA1819))","v":""},null,null,null,null,null,null,null,null,null,null,null,null,null,null,null,null,null,null,null,null,null,null,0,{"$f":"AB1819-AB1818","v":0}]
[null,null,null,null,null,null,null,null,null,null,null,null,null,null,null,null,null,null,null,null,null,null,null,null,null,null,null,0]
[170,null,null,null,{"$f":"IF(COUNTA(H1821:AA1821)=0,\"\",COUNTA(H1821:AA1821))","v":""},null,null,null,null,null,null,null,null,null,null,null,null,null,null,null,null,null,null,null,null,null,null,0,{"$f":"AB1821-AB1820","v":0}]
[null,null,null,null,null,null,null,null,null,null,null,null,null,null,null,null,null,null,null,null,null,null,null,null,null,null,null,0]
[170,null,null,null,{"$f":"IF(COUNTA(H1823:AA1823)=0,\"\",COUNTA(H1823:AA1823))","v":""},null,null,null,null,null,null,null,null,null,null,null,null,null,null,null,null,null,null,null,null,null,null,0,{"$f":"AB1823-AB1822","v":0}]
[null,null,null,null,null,null,null,null,null,null,null,null,null,null,null,null,null,null,null,null,null,null,null,null,null,null,null,0]
[171,null,{"$f":"IF(G2578=\"\",\"\",G2578)","v":"t171"},null,{"$f":"IF(COUNTA(H1825:AA1825)=0,\"\",COUNTA(H1825:AA1825))","v":""},null,null,null,null,null,null,null,null,null,null,null,null,null,null,null,null,null,null,null,null,null,null,0,{"$f":"AB1825-AB1824","v":0}]
[null,null,null,null,null,null,null,null,null,null,null,null,null,null,null,null,null,null,null,null,null,null,null,null,null,null,null,0]
[171,null,null,null,{"$f":"IF(COUNTA(H1827:AA1827)=0,\"\",COUNTA(H1827:AA1827))","v":""},null,null,null,null,null,null,null,null,null,null,null,null,null,null,null,null,null,null,null,null,null,null,0,{"$f":"AB1827-AB1826","v":0}]
[null,null,null,null,null,null,null,null,null,null,null,null,null,null,null,null,null,null,null,null,null,null,null,null,null,null,null,{"$f":"COUNTA(H1828:AA1828)","v":0}]
[171,null,null,null,{"$f":"IF(COUNTA(H1829:AA1829)=0,\"\",COUNTA(H1829:AA1829))","v":""},null,null,null,null,null,null,null,null,null,null,null,null,null,null,null,null,null,null,null,null,null,null,0,{"$f":"AB1829-AB1828","v":0}]
[null,null,null,null,null,null,null,null,null,null,null,null,null,null,null,null,null,null,null,null,null,null,null,null,null,null,null,0]
[171,null,null,null,{"$f":"IF(COUNTA(H1831:AA1831)=0,\"\",COUNTA(H1831:AA1831))","v":""},null,null,null,null,null,null,null,null,null,null,null,null,null,null,null,null,null,null,null,null,null,null,0,{"$f":"AB1831-AB1830","v":0}]
[null,null,null,null,null,null,null,null,null,null,null,null,null,null,null,null,null,null,null,null,null,null,null,null,null,null,null,0]
[171,null,null,null,{"$f":"IF(COUNTA(H1833:AA1833)=0,\"\",COUNTA(H1833:AA1833))","v":""},null,null,null,null,null,null,null,null,null,null,null,null,null,null,null,null,null,null,null,null,null,null,0,{"$f":"AB1833-AB1832","v":0}]
[null,null,null,null,null,null,null,null,null,null,null,null,null,null,null,null,null,null,null,null,null,null,null,null,null,null,null,0]
[172,null,{"$f":"IF(G2580=\"\",\"\",G2580)","v":"t172"},null,{"$f":"IF(COUNTA(H1835:AA1835)=0,\"\",COUNTA(H1835:AA1835))","v":""},null,null,null,null,null,null,null,null,null,null,null,null,null,null,null,null,null,null,null,null,null,null,0,{"$f":"AB1835-AB1834","v":0}]
[null,null,null,null,null,null,null,null,null,null,null,null,null,null,null,null,null,null,null,null,null,null,null,null,null,null,null,0]
[172,null,null,null,{"$f":"IF(COUNTA(H1837:AA1837)=0,\"\",COUNTA(H1837:AA1837))","v":""},null,null,null,null,null,null,null,null,null,null,null,null,null,null,null,null,null,null,null,null,null,null,0,{"$f":"AB1837-AB1836","v":0}]
[null,null,null,null,null,null,null,null,null,null,null,null,null,null,null,null,null,null,null,null,null,null,null,null,null,null,null,0]
[172,null,null,null,{"$f":"IF(COUNTA(H1839:AA1839)=0,\"\",COUNTA(H1839:AA1839))","v":""},null,null,null,null,null,null,null,null,null,null,null,null,null,null,null,null,null,null,null,null,null,null,0,{"$f":"AB1839-AB1838","v":0}]
[null,null,null,null,null,null,null,null,null,null,null,null,null,null,null,null,null,null,null,null,null,null,null,null,null,null,null,0]
[172,null,null,null,{"$f":"IF(COUNTA(H1841:AA1841)=0,\"\",COUNTA(H1841:AA1841))","v":""},null,null,null,null,null,null,null,null,null,null,null,null,null,null,null,null,null,null,null,null,null,null,0,{"$f":"AB1841-AB1840","v":0}]
[null,null,null,null,null,null,null,null,null,null,null,null,null,null,null,null,null,null,null,null,null,null,null,null,null,null,null,0]
[172,null,null,null,{"$f":"IF(COUNTA(H1843:AA1843)=0,\"\",COUNTA(H1843:AA1843))","v":""},null,null,null,null,null,null,null,null,null,null,null,null,null,null,null,null,null,null,null,null,null,null,0,{"$f":"AB1843-AB1842","v":0}]
[null,"専",null,null,null,null,null,null,null,null,null,null,null,null,null,null,null,null,null,null,null,null,null,null,null,null,null,0]
[173,null,{"$f":"IF(G2582=\"\",\"\",G2582)","v":"t173"},null,{"$f":"IF(COUNTA(H1845:AA1845)=0,\"\",COUNTA(H1845:AA1845))","v":""},null,null,null,null,null,null,null,null,null,null,null,null,null,null,null,null,null,null,null,null,null,null,0,{"$f":"AB1845-AB1844","v":0}]
[null,null,null,null,null,null,null,null,null,null,null,null,null,null,null,null,null,null,null,null,null,null,null,null,null,null,null,0]
[173,null,null,null,{"$f":"IF(COUNTA(H1847:AA1847)=0,\"\",COUNTA(H1847:AA1847))","v":""},null,null,null,null,null,null,null,null,null,null,null,null,null,null,null,null,null,null,null,null,null,null,0,{"$f":"AB1847-AB1846","v":0}]
[null,null,null,null,null,null,null,null,null,null,null,null,null,null,null,null,null,null,null,null,null,null,null,null,null,null,null,0]
[173,null,null,null,{"$f":"IF(COUNTA(H1849:AA1849)=0,\"\",COUNTA(H1849:AA1849))","v":""},null,null,null,null,null,null,null,null,null,null,null,null,null,null,null,null,null,null,null,null,null,null,0,{"$f":"AB1849-AB1848","v":0}]
[null,null,null,null,null,null,null,null,null,null,null,null,null,null,null,null,null,null,null,null,null,null,null,null,null,null,null,0]
[173,null,null,null,{"$f":"IF(COUNTA(H1851:AA1851)=0,\"\",COUNTA(H1851:AA1851))","v":""},null,null,null,null,null,null,null,null,null,null,null,null,null,null,null,null,null,null,null,null,null,null,0,{"$f":"AB1851-AB1850","v":0}]
[null,null,null,null,null,null,null,null,null,null,null,null,null,null,null,null,null,null,null,null,null,null,null,null,null,null,null,0]
[173,null,null,null,{"$f":"IF(COUNTA(H1853:AA1853)=0,\"\",COUNTA(H1853:AA1853))","v":""},null,null,null,null,null,null,null,null,null,null,null,null,null,null,null,null,null,null,null,null,null,null,0,{"$f":"AB1853-AB1852","v":0}]
[null,null,null,null,null,null,null,null,null,null,null,null,null,null,null,null,null,null,null,null,null,null,null,null,null,null,null,0]
[174,null,{"$f":"IF(G2584=\"\",\"\",G2584)","v":"t174"},null,{"$f":"IF(COUNTA(H1855:AA1855)=0,\"\",COUNTA(H1855:AA1855))","v":""},null,null,null,null,null,null,null,null,null,null,null,null,null,null,null,null,null,null,null,null,null,null,0,{"$f":"AB1855-AB1854","v":0}]
[null,null,null,null,null,null,null,null,null,null,null,null,null,null,null,null,null,null,null,null,null,null,null,null,null,null,null,0]
[174,null,null,null,{"$f":"IF(COUNTA(H1857:AA1857)=0,\"\",COUNTA(H1857:AA1857))","v":""},null,null,null,null,null,null,null,null,null,null,null,null,null,null,null,null,null,null,null,null,null,null,0,{"$f":"AB1857-AB1856","v":0}]
[null,null,null,null,null,null,null,null,null,null,null,null,null,null,null,null,null,null,null,null,null,null,null,null,null,null,null,0]
[174,null,null,null,{"$f":"IF(COUNTA(H1859:AA1859)=0,\"\",COUNTA(H1859:AA1859))","v":""},null,null,null,null,null,null,null,null,null,null,null,null,null,null,null,null,null,null,null,null,null,null,0,{"$f":"AB1859-AB1858","v":0}]
[null,null,null,null,null,null,null,null,null,null,null,null,null,null,null,null,null,null,null,null,null,null,null,null,null,null,null,0]
[174,null,null,null,{"$f":"IF(COUNTA(H1861:AA1861)=0,\"\",COUNTA(H1861:AA1861))","v":""},null,null,null,null,null,null,null,null,null,null,null,null,null,null,null,null,null,null,null,null,null,null,0,{"$f":"AB1861-AB1860","v":0}]
[null,null,null,null,null,null,null,null,null,null,null,null,null,null,null,null,null,null,null,null,null,null,null,null,null,null,null,0]
[174,null,null,null,{"$f":"IF(COUNTA(H1863:AA1863)=0,\"\",COUNTA(H1863:AA1863))","v":""},null,null,null,null,null,null,null,null,null,null,null,null,null,null,null,null,null,null,null,null,null,null,0,{"$f":"AB1863-AB1862","v":0}]
[null,null,null,null,null,null,null,null,null,null,null,null,null,null,null,null,null,null,null,null,null,null,null,null,null,null,null,0]
[175,null,{"$f":"IF(G2586=\"\",\"\",G2586)","v":"t175"},null,{"$f":"IF(COUNTA(H1865:AA1865)=0,\"\",COUNTA(H1865:AA1865))","v":""},null,null,null,null,null,null,null,null,null,null,null,null,null,null,null,null,null,null,null,null,null,null,0,{"$f":"AB1865-AB1864","v":0}]
[null,null,null,null,null,null,null,null,null,null,null,null,null,null,null,null,null,null,null,null,null,null,null,null,null,null,null,0]
[175,null,null,null,{"$f":"IF(COUNTA(H1867:AA1867)=0,\"\",COUNTA(H1867:AA1867))","v":""},null,null,null,null,null,null,null,null,null,null,null,null,null,null,null,null,null,null,null,null,null,null,0,{"$f":"AB1867-AB1866","v":0}]
[null,null,null,null,null,null,null,null,null,null,null,null,null,null,null,null,null,null,null,null,null,null,null,null,null,null,null,0]
[175,null,null,null,{"$f":"IF(COUNTA(H1869:AA1869)=0,\"\",COUNTA(H1869:AA1869))","v":""},null,null,null,null,null,null,null,null,null,null,null,null,null,null,null,null,null,null,null,null,null,null,0,{"$f":"AB1869-AB1868","v":0}]
[null,null,null,null,null,null,null,null,null,null,null,null,null,null,null,null,null,null,null,null,null,null,null,null,null,null,null,0]
[175,null,null,null,{"$f":"IF(COUNTA(H1871:AA1871)=0,\"\",COUNTA(H1871:AA1871))","v":""},null,null,null,null,null,null,null,null,null,null,null,null,null,null,null,null,null,null,null,null,null,null,0,{"$f":"AB1871-AB1870","v":0}]
[null,null,null,null,null,null,null,null,null,null,null,null,null,null,null,null,null,null,null,null,null,null,null,null,null,null,null,0]
[175,"門",null,null,{"$f":"IF(COUNTA(H1873:AA1873)=0,\"\",COUNTA(H1873:AA1873))","v":""},null,null,null,null,null,null,null,null,null,null,null,null,null,null,null,null,null,null,null,null,null,null,0,{"$f":"AB1873-AB1872","v":0}]
[null,null,null,null,null,null,null,null,null,null,null,null,null,null,null,null,null,null,null,null,null,null,null,null,null,null,null,0]
[176,null,{"$f":"IF(G2588=\"\",\"\",G2588)","v":"t176"},null,{"$f":"IF(COUNTA(H1875:AA1875)=0,\"\",COUNTA(H1875:AA1875))","v":""},null,null,null,null,null,null,null,null,null,null,null,null,null,null,null,null,null,null,null,null,null,null,0,{"$f":"AB1875-AB1874","v":0}]
[null,null,null,null,null,null,null,null,null,null,null,null,null,null,null,null,null,null,null,null,null,null,null,null,null,null,null,0]
[176,null,null,null,{"$f":"IF(COUNTA(H1877:AA1877)=0,\"\",COUNTA(H1877:AA1877))","v":""},null,null,null,null,null,null,null,null,null,null,null,null,null,null,null,null,null,null,null,null,null,null,0,{"$f":"AB1877-AB1876","v":0}]
[null,null,null,null,null,null,null,null,null,null,null,null,null,null,null,null,null,null,null,null,null,null,null,null,null,null,null,0]
[176,null,null,null,{"$f":"IF(COUNTA(H1879:AA1879)=0,\"\",COUNTA(H1879:AA1879))","v":""},null,null,null,null,null,null,null,null,null,null,null,null,null,null,null,null,null,null,null,null,null,null,0,{"$f":"AB1879-AB1878","v":0}]
[null,null,null,null,null,null,null,null,null,null,null,null,null,null,null,null,null,null,null,null,null,null,null,null,null,null,null,0]
[176,null,null,null,{"$f":"IF(COUNTA(H1881:AA1881)=0,\"\",COUNTA(H1881:AA1881))","v":""},null,null,null,null,null,null,null,null,null,null,null,null,null,null,null,null,null,null,null,null,null,null,0,{"$f":"AB1881-AB1880","v":0}]
[null,null,null,null,null,null,null,null,null,null,null,null,null,null,null,null,null,null,null,null,null,null,null,null,null,null,null,0]
[176,null,null,null,{"$f":"IF(COUNTA(H1883:AA1883)=0,\"\",COUNTA(H1883:AA1883))","v":""},null,null,null,null,null,null,null,null,null,null,null,null,null,null,null,null,null,null,null,null,null,null,0,{"$f":"AB1883-AB1882","v":0}]
[null,null,null,null,null,null,null,null,null,null,null,null,null,null,null,null,null,null,null,null,null,null,null,null,null,null,null,0]
[177,null,{"$f":"IF(G2590=\"\",\"\",G2590)","v":"t177"},null,{"$f":"IF(COUNTA(H1885:AA1885)=0,\"\",COUNTA(H1885:AA1885))","v":""},null,null,null,null,null,null,null,null,null,null,null,null,null,null,null,null,null,null,null,null,null,null,0,{"$f":"AB1885-AB1884","v":0}]
[null,null,null,null,null,null,null,null,null,null,null,null,null,null,null,null,null,null,null,null,null,null,null,null,null,null,null,0]
[177,null,null,null,{"$f":"IF(COUNTA(H1887:AA1887)=0,\"\",COUNTA(H1887:AA1887))","v":""},null,null,null,null,null,null,null,null,null,null,null,null,null,null,null,null,null,null,null,null,null,null,0,{"$f":"AB1887-AB1886","v":0}]
[null,null,null,null,null,null,null,null,null,null,null,null,null,null,null,null,null,null,null,null,null,null,null,null,null,null,null,0]
[177,null,null,null,{"$f":"IF(COUNTA(H1889:AA1889)=0,\"\",COUNTA(H1889:AA1889))","v":""},null,null,null,null,null,null,null,null,null,null,null,null,null,null,null,null,null,null,null,null,null,null,0,{"$f":"AB1889-AB1888","v":0}]
[null,null,null,null,null,null,null,null,null,null,null,null,null,null,null,null,null,null,null,null,null,null,null,null,null,null,null,0]
[177,null,null,null,{"$f":"IF(COUNTA(H1891:AA1891)=0,\"\",COUNTA(H1891:AA1891))","v":""},null,null,null,null,null,null,null,null,null,null,null,null,null,null,null,null,null,null,null,null,null,null,0,{"$f":"AB1891-AB1890","v":0}]
[null,null,null,null,null,null,null,null,null,null,null,null,null,null,null,null,null,null,null,null,null,null,null,null,null,null,null,{"$f":"COUNTA(H1892:AA1892)","v":0}]
[177,null,null,null,{"$f":"IF(COUNTA(H1893:AA1893)=0,\"\",COUNTA(H1893:AA1893))","v":""},null,null,null,null,null,null,null,null,null,null,null,null,null,null,null,null,null,null,null,null,null,null,0,{"$f":"AB1893-AB1892","v":0}]
[null,null,null,null,null,null,null,null,null,null,null,null,null,null,null,null,null,null,null,null,null,null,null,null,null,null,null,0]
[178,null,{"$f":"IF(G2592=\"\",\"\",G2592)","v":"t178"},null,{"$f":"IF(COUNTA(H1895:AA1895)=0,\"\",COUNTA(H1895:AA1895))","v":""},null,null,null,null,null,null,null,null,null,null,null,null,null,null,null,null,null,null,null,null,null,null,0,{"$f":"AB1895-AB1894","v":0}]
[null,null,null,null,null,null,null,null,null,null,null,null,null,null,null,null,null,null,null,null,null,null,null,null,null,null,null,0]
[178,null,null,null,{"$f":"IF(COUNTA(H1897:AA1897)=0,\"\",COUNTA(H1897:AA1897))","v":""},null,null,null,null,null,null,null,null,null,null,null,null,null,null,null,null,null,null,null,null,null,null,0,{"$f":"AB1897-AB1896","v":0}]
[null,null,null,null,null,null,null,null,null,null,null,null,null,null,null,null,null,null,null,null,null,null,null,null,null,null,null,0]
[178,null,null,null,{"$f":"IF(COUNTA(H1899:AA1899)=0,\"\",COUNTA(H1899:AA1899))","v":""},null,null,null,null,null,null,null,null,null,null,null,null,null,null,null,null,null,null,null,null,null,null,0,{"$f":"AB1899-AB1898","v":0}]
[null,null,null,null,null,null,null,null,null,null,null,null,null,null,null,null,null,null,null,null,null,null,null,null,null,null,null,0]
[178,null,null,null,{"$f":"IF(COUNTA(H1901:AA1901)=0,\"\",COUNTA(H1901:AA1901))","v":""},null,null,null,null,null,null,null,null,null,null,null,null,null,null,null,null,null,null,null,null,null,null,0,{"$f":"AB1901-AB1900","v":0}]
[null,null,null,null,null,null,null,null,null,null,null,null,null,null,null,null,null,null,null,null,null,null,null,null,null,null,null,0]
[178,"２",null,null,{"$f":"IF(COUNTA(H1903:AA1903)=0,\"\",COUNTA(H1903:AA1903))","v":""},null,null,null,null,null,null,null,null,null,null,null,null,null,null,null,null,null,null,null,null,null,null,0,{"$f":"AB1903-AB1902","v":0}]
[null,null,null,null,null,null,null,null,null,null,null,null,null,null,null,null,null,null,null,null,null,null,null,null,null,null,null,0]
[179,null,{"$f":"IF(G2594=\"\",\"\",G2594)","v":"t179"},null,{"$f":"IF(COUNTA(H1905:AA1905)=0,\"\",COUNTA(H1905:AA1905))","v":""},null,null,null,null,null,null,null,null,null,null,null,null,null,null,null,null,null,null,null,null,null,null,0,{"$f":"AB1905-AB1904","v":0}]
[null,null,null,null,null,null,null,null,null,null,null,null,null,null,null,null,null,null,null,null,null,null,null,null,null,null,null,0]
[179,null,null,null,{"$f":"IF(COUNTA(H1907:AA1907)=0,\"\",COUNTA(H1907:AA1907))","v":""},null,null,null,null,null,null,null,null,null,null,null,null,null,null,null,null,null,null,null,null,null,null,0,{"$f":"AB1907-AB1906","v":0}]
[null,null,null,null,null,null,null,null,null,null,null,null,null,null,null,null,null,null,null,null,null,null,null,null,null,null,null,0]
[179,null,null,null,{"$f":"IF(COUNTA(H1909:AA1909)=0,\"\",COUNTA(H1909:AA1909))","v":""},null,null,null,null,null,null,null,null,null,null,null,null,null,null,null,null,null,null,null,null,null,null,0,{"$f":"AB1909-AB1908","v":0}]
[null,null,null,null,null,null,null,null,null,null,null,null,null,null,null,null,null,null,null,null,null,null,null,null,null,null,null,0]
[179,null,null,null,{"$f":"IF(COUNTA(H1911:AA1911)=0,\"\",COUNTA(H1911:AA1911))","v":""},null,null,null,null,null,null,null,null,null,null,null,null,null,null,null,null,null,null,null,null,null,null,0,{"$f":"AB1911-AB1910","v":0}]
[null,null,null,null,null,null,null,null,null,null,null,null,null,null,null,null,null,null,null,null,null,null,null,null,null,null,null,0]
[179,null,null,null,{"$f":"IF(COUNTA(H1913:AA1913)=0,\"\",COUNTA(H1913:AA1913))","v":""},null,null,null,null,null,null,null,null,null,null,null,null,null,null,null,null,null,null,null,null,null,null,0,{"$f":"AB1913-AB1912","v":0}]
[null,null,null,null,null,null,null,null,null,null,null,null,null,null,null,null,null,null,null,null,null,null,null,null,null,null,null,0]
[180,null,{"$f":"IF(G2596=\"\",\"\",G2596)","v":"t180"},null,{"$f":"IF(COUNTA(H1915:AA1915)=0,\"\",COUNTA(H1915:AA1915))","v":""},null,null,null,null,null,null,null,null,null,null,null,null,null,null,null,null,null,null,null,null,null,null,0,{"$f":"AB1915-AB1914","v":0}]
[null,null,null,null,null,null,null,null,null,null,null,null,null,null,null,null,null,null,null,null,null,null,null,null,null,null,null,0]
[180,null,null,null,{"$f":"IF(COUNTA(H1917:AA1917)=0,\"\",COUNTA(H1917:AA1917))","v":""},null,null,null,null,null,null,null,null,null,null,null,null,null,null,null,null,null,null,null,null,null,null,0,{"$f":"AB1917-AB1916","v":0}]
[null,null,null,null,null,null,null,null,null,null,null,null,null,null,null,null,null,null,null,null,null,null,null,null,null,null,null,0]
[180,null,null,null,{"$f":"IF(COUNTA(H1919:AA1919)=0,\"\",COUNTA(H1919:AA1919))","v":""},null,null,null,null,null,null,null,null,null,null,null,null,null,null,null,null,null,null,null,null,null,null,0,{"$f":"AB1919-AB1918","v":0}]
[null,null,null,null,null,null,null,null,null,null,null,null,null,null,null,null,null,null,null,null,null,null,null,null,null,null,null,0]
[180,null,null,null,{"$f":"IF(COUNTA(H1921:AA1921)=0,\"\",COUNTA(H1921:AA1921))","v":""},null,null,null,null,null,null,null,null,null,null,null,null,null,null,null,null,null,null,null,null,null,null,0,{"$f":"AB1921-AB1920","v":0}]
[null,null,null,null,null,null,null,null,null,null,null,null,null,null,null,null,null,null,null,null,null,null,null,null,null,null,null,0]
[180,null,null,null,{"$f":"IF(COUNTA(H1923:AA1923)=0,\"\",COUNTA(H1923:AA1923))","v":""},null,null,null,null,null,null,null,null,null,null,null,null,null,null,null,null,null,null,null,null,null,null,0,{"$f":"AB1923-AB1922","v":0}]
[null,null,null,null,null,null,null,null,null,null,null,null,null,null,null,null,null,null,null,null,null,null,null,null,null,null,null,0]
[181,null,{"$f":"IF(G2598=\"\",\"\",G2598)","v":"t181"},null,{"$f":"IF(COUNTA(H1925:AA1925)=0,\"\",COUNTA(H1925:AA1925))","v":""},null,null,null,null,null,null,null,null,null,null,null,null,null,null,null,null,null,null,null,null,null,null,0,{"$f":"AB1925-AB1924","v":0}]
[null,null,null,null,null,null,null,null,null,null,null,null,null,null,null,null,null,null,null,null,null,null,null,null,null,null,null,0]
[181,null,null,null,{"$f":"IF(COUNTA(H1927:AA1927)=0,\"\",COUNTA(H1927:AA1927))","v":""},null,null,null,null,null,null,null,null,null,null,null,null,null,null,null,null,null,null,null,null,null,null,0,{"$f":"AB1927-AB1926","v":0}]
[null,null,null,null,null,null,null,null,null,null,null,null,null,null,null,null,null,null,null,null,null,null,null,null,null,null,null,0]
[181,null,null,null,{"$f":"IF(COUNTA(H1929:AA1929)=0,\"\",COUNTA(H1929:AA1929))","v":""},null,null,null,null,null,null,null,null,null,null,null,null,null,null,null,null,null,null,null,null,null,null,0,{"$f":"AB1929-AB1928","v":0}]
[null,null,null,null,null,null,null,null,null,null,null,null,null,null,null,null,null,null,null,null,null,null,null,null,null,null,null,0]
[181,null,null,null,{"$f":"IF(COUNTA(H1931:AA1931)=0,\"\",COUNTA(H1931:AA1931))","v":""},null,null,null,null,null,null,null,null,null,null,null,null,null,null,null,null,null,null,null,null,null,null,0,{"$f":"AB1931-AB1930","v":0}]
[null,null,null,null,null,null,null,null,null,null,null,null,null,null,null,null,null,null,null,null,null,null,null,null,null,null,null,0]
[181,null,null,null,{"$f":"IF(COUNTA(H1933:AA1933)=0,\"\",COUNTA(H1933:AA1933))","v":""},null,null,null,null,null,null,null,null,null,null,null,null,null,null,null,null,null,null,null,null,null,null,0,{"$f":"AB1933-AB1932","v":0}]
[null,null,null,null,null,null,null,null,null,null,null,null,null,null,null,null,null,null,null,null,null,null,null,null,null,null,null,0]
[182,null,{"$f":"IF(G2600=\"\",\"\",G2600)","v":"t182"},null,{"$f":"IF(COUNTA(H1935:AA1935)=0,\"\",COUNTA(H1935:AA1935))","v":""},null,null,null,null,null,null,null,null,null,null,null,null,null,null,null,null,null,null,null,null,null,null,0,{"$f":"AB1935-AB1934","v":0}]
[null,null,null,null,null,null,null,null,null,null,null,null,null,null,null,null,null,null,null,null,null,null,null,null,null,null,null,0]
[182,null,null,null,{"$f":"IF(COUNTA(H1937:AA1937)=0,\"\",COUNTA(H1937:AA1937))","v":""},null,null,null,null,null,null,null,null,null,null,null,null,null,null,null,null,null,null,null,null,null,null,0,{"$f":"AB1937-AB1936","v":0}]
[null,null,null,null,null,null,null,null,null,null,null,null,null,null,null,null,null,null,null,null,null,null,null,null,null,null,null,0]
[182,null,null,null,{"$f":"IF(COUNTA(H1939:AA1939)=0,\"\",COUNTA(H1939:AA1939))","v":""},null,null,null,null,null,null,null,null,null,null,null,null,null,null,null,null,null,null,null,null,null,null,0,{"$f":"AB1939-AB1938","v":0}]
[null,null,null,null,null,null,null,null,null,null,null,null,null,null,null,null,null,null,null,null,null,null,null,null,null,null,null,0]
[182,null,null,null,{"$f":"IF(COUNTA(H1941:AA1941)=0,\"\",COUNTA(H1941:AA1941))","v":""},null,null,null,null,null,null,null,null,null,null,null,null,null,null,null,null,null,null,null,null,null,null,0,{"$f":"AB1941-AB1940","v":0}]
[null,null,null,null,null,null,null,null,null,null,null,null,null,null,null,null,null,null,null,null,null,null,null,null,null,null,null,0]
[182,null,null,null,{"$f":"IF(COUNTA(H1943:AA1943)=0,\"\",COUNTA(H1943:AA1943))","v":""},null,null,null,null,null,null,null,null,null,null,null,null,null,null,null,null,null,null,null,null,null,null,0,{"$f":"AB1943-AB1942","v":0}]
[null,"専",null,null,null,null,null,null,null,null,null,null,null,null,null,null,null,null,null,null,null,null,null,null,null,null,null,0]
[183,null,{"$f":"IF(G2602=\"\",\"\",G2602)","v":"t183"},null,{"$f":"IF(COUNTA(H1945:AA1945)=0,\"\",COUNTA(H1945:AA1945))","v":""},null,null,null,null,null,null,null,null,null,null,null,null,null,null,null,null,null,null,null,null,null,null,0,{"$f":"AB1945-AB1944","v":0}]
[null,null,null,null,null,null,null,null,null,null,null,null,null,null,null,null,null,null,null,null,null,null,null,null,null,null,null,0]
[183,null,null,null,{"$f":"IF(COUNTA(H1947:AA1947)=0,\"\",COUNTA(H1947:AA1947))","v":""},null,null,null,null,null,null,null,null,null,null,null,null,null,null,null,null,null,null,null,null,null,null,0,{"$f":"AB1947-AB1946","v":0}]
[null,null,null,null,null,null,null,null,null,null,null,null,null,null,null,null,null,null,null,null,null,null,null,null,null,null,null,0]
[183,null,null,null,{"$f":"IF(COUNTA(H1949:AA1949)=0,\"\",COUNTA(H1949:AA1949))","v":""},null,null,null,null,null,null,null,null,null,null,null,null,null,null,null,null,null,null,null,null,null,null,0,{"$f":"AB1949-AB1948","v":0}]
[null,null,null,null,null,null,null,null,null,null,null,null,null,null,null,null,null,null,null,null,null,null,null,null,null,null,null,0]
[183,null,null,null,{"$f":"IF(COUNTA(H1951:AA1951)=0,\"\",COUNTA(H1951:AA1951))","v":""},null,null,null,null,null,null,null,null,null,null,null,null,null,null,null,null,null,null,null,null,null,null,0,{"$f":"AB1951-AB1950","v":0}]
[null,null,null,null,null,null,null,null,null,null,null,null,null,null,null,null,null,null,null,null,null,null,null,null,null,null,null,0]
[183,null,null,null,{"$f":"IF(COUNTA(H1953:AA1953)=0,\"\",COUNTA(H1953:AA1953))","v":""},null,null,null,null,null,null,null,null,null,null,null,null,null,null,null,null,null,null,null,null,null,null,0,{"$f":"AB1953-AB1952","v":0}]
[null,null,null,null,null,null,null,null,null,null,null,null,null,null,null,null,null,null,null,null,null,null,null,null,null,null,null,0]
[184,null,{"$f":"IF(G2604=\"\",\"\",G2604)","v":"t184"},null,{"$f":"IF(COUNTA(H1955:AA1955)=0,\"\",COUNTA(H1955:AA1955))","v":""},null,null,null,null,null,null,null,null,null,null,null,null,null,null,null,null,null,null,null,null,null,null,0,{"$f":"AB1955-AB1954","v":0}]
[null,null,null,null,null,null,null,null,null,null,null,null,null,null,null,null,null,null,null,null,null,null,null,null,null,null,null,{"$f":"COUNTA(H1956:AA1956)","v":0}]
[184,null,null,null,{"$f":"IF(COUNTA(H1957:AA1957)=0,\"\",COUNTA(H1957:AA1957))","v":""},null,null,null,null,null,null,null,null,null,null,null,null,null,null,null,null,null,null,null,null,null,null,0,{"$f":"AB1957-AB1956","v":0}]
[null,null,null,null,null,null,null,null,null,null,null,null,null,null,null,null,null,null,null,null,null,null,null,null,null,null,null,0]
[184,null,null,null,{"$f":"IF(COUNTA(H1959:AA1959)=0,\"\",COUNTA(H1959:AA1959))","v":""},null,null,null,null,null,null,null,null,null,null,null,null,null,null,null,null,null,null,null,null,null,null,0,{"$f":"AB1959-AB1958","v":0}]
[null,null,null,null,null,null,null,null,null,null,null,null,null,null,null,null,null,null,null,null,null,null,null,null,null,null,null,0]
[184,null,null,null,{"$f":"IF(COUNTA(H1961:AA1961)=0,\"\",COUNTA(H1961:AA1961))","v":""},null,null,null,null,null,null,null,null,null,null,null,null,null,null,null,null,null,null,null,null,null,null,0,{"$f":"AB1961-AB1960","v":0}]
[null,null,null,null,null,null,null,null,null,null,null,null,null,null,null,null,null,null,null,null,null,null,null,null,null,null,null,0]
[184,null,null,null,{"$f":"IF(COUNTA(H1963:AA1963)=0,\"\",COUNTA(H1963:AA1963))","v":""},null,null,null,null,null,null,null,null,null,null,null,null,null,null,null,null,null,null,null,null,null,null,0,{"$f":"AB1963-AB1962","v":0}]
[null,null,null,null,null,null,null,null,null,null,null,null,null,null,null,null,null,null,null,null,null,null,null,null,null,null,null,0]
[185,null,{"$f":"IF(G2606=\"\",\"\",G2606)","v":"t185"},null,{"$f":"IF(COUNTA(H1965:AA1965)=0,\"\",COUNTA(H1965:AA1965))","v":""},null,null,null,null,null,null,null,null,null,null,null,null,null,null,null,null,null,null,null,null,null,null,0,{"$f":"AB1965-AB1964","v":0}]
[null,null,null,null,null,null,null,null,null,null,null,null,null,null,null,null,null,null,null,null,null,null,null,null,null,null,null,0]
[185,null,null,null,{"$f":"IF(COUNTA(H1967:AA1967)=0,\"\",COUNTA(H1967:AA1967))","v":""},null,null,null,null,null,null,null,null,null,null,null,null,null,null,null,null,null,null,null,null,null,null,0,{"$f":"AB1967-AB1966","v":0}]
[null,null,null,null,null,null,null,null,null,null,null,null,null,null,null,null,null,null,null,null,null,null,null,null,null,null,null,0]
[185,null,null,null,{"$f":"IF(COUNTA(H1969:AA1969)=0,\"\",COUNTA(H1969:AA1969))","v":""},null,null,null,null,null,null,null,null,null,null,null,null,null,null,null,null,null,null,null,null,null,null,0,{"$f":"AB1969-AB1968","v":0}]
[null,null,null,null,null,null,null,null,null,null,null,null,null,null,null,null,null,null,null,null,null,null,null,null,null,null,null,0]
[185,null,null,null,{"$f":"IF(COUNTA(H1971:AA1971)=0,\"\",COUNTA(H1971:AA1971))","v":""},null,null,null,null,null,null,null,null,null,null,null,null,null,null,null,null,null,null,null,null,null,null,0,{"$f":"AB1971-AB1970","v":0}]
[null,null,null,null,null,null,null,null,null,null,null,null,null,null,null,null,null,null,null,null,null,null,null,null,null,null,null,0]
[185,"門",null,null,{"$f":"IF(COUNTA(H1973:AA1973)=0,\"\",COUNTA(H1973:AA1973))","v":""},null,null,null,null,null,null,null,null,null,null,null,null,null,null,null,null,null,null,null,null,null,null,0,{"$f":"AB1973-AB1972","v":0}]
[null,null,null,null,null,null,null,null,null,null,null,null,null,null,null,null,null,null,null,null,null,null,null,null,null,null,null,0]
[186,null,{"$f":"IF(G2608=\"\",\"\",G2608)","v":"t186"},null,{"$f":"IF(COUNTA(H1975:AA1975)=0,\"\",COUNTA(H1975:AA1975))","v":""},null,null,null,null,null,null,null,null,null,null,null,null,null,null,null,null,null,null,null,null,null,null,0,{"$f":"AB1975-AB1974","v":0}]
[null,null,null,null,null,null,null,null,null,null,null,null,null,null,null,null,null,null,null,null,null,null,null,null,null,null,null,0]
[186,null,null,null,{"$f":"IF(COUNTA(H1977:AA1977)=0,\"\",COUNTA(H1977:AA1977))","v":""},null,null,null,null,null,null,null,null,null,null,null,null,null,null,null,null,null,null,null,null,null,null,0,{"$f":"AB1977-AB1976","v":0}]
[null,null,null,null,null,null,null,null,null,null,null,null,null,null,null,null,null,null,null,null,null,null,null,null,null,null,null,0]
[186,null,null,null,{"$f":"IF(COUNTA(H1979:AA1979)=0,\"\",COUNTA(H1979:AA1979))","v":""},null,null,null,null,null,null,null,null,null,null,null,null,null,null,null,null,null,null,null,null,null,null,0,{"$f":"AB1979-AB1978","v":0}]
[null,null,null,null,null,null,null,null,null,null,null,null,null,null,null,null,null,null,null,null,null,null,null,null,null,null,null,0]
[186,null,null,null,{"$f":"IF(COUNTA(H1981:AA1981)=0,\"\",COUNTA(H1981:AA1981))","v":""},null,null,null,null,null,null,null,null,null,null,null,null,null,null,null,null,null,null,null,null,null,null,0,{"$f":"AB1981-AB1980","v":0}]
[null,null,null,null,null,null,null,null,null,null,null,null,null,null,null,null,null,null,null,null,null,null,null,null,null,null,null,0]
[186,null,null,null,{"$f":"IF(COUNTA(H1983:AA1983)=0,\"\",COUNTA(H1983:AA1983))","v":""},null,null,null,null,null,null,null,null,null,null,null,null,null,null,null,null,null,null,null,null,null,null,0,{"$f":"AB1983-AB1982","v":0}]
[null,null,null,null,null,null,null,null,null,null,null,null,null,null,null,null,null,null,null,null,null,null,null,null,null,null,null,0]
[187,null,{"$f":"IF(G2610=\"\",\"\",G2610)","v":"t187"},null,{"$f":"IF(COUNTA(H1985:AA1985)=0,\"\",COUNTA(H1985:AA1985))","v":""},null,null,null,null,null,null,null,null,null,null,null,null,null,null,null,null,null,null,null,null,null,null,0,{"$f":"AB1985-AB1984","v":0}]
[null,null,null,null,null,null,null,null,null,null,null,null,null,null,null,null,null,null,null,null,null,null,null,null,null,null,null,0]
[187,null,null,null,{"$f":"IF(COUNTA(H1987:AA1987)=0,\"\",COUNTA(H1987:AA1987))","v":""},null,null,null,null,null,null,null,null,null,null,null,null,null,null,null,null,null,null,null,null,null,null,0,{"$f":"AB1987-AB1986","v":0}]
[null,null,null,null,null,null,null,null,null,null,null,null,null,null,null,null,null,null,null,null,null,null,null,null,null,null,null,0]
[187,null,null,null,{"$f":"IF(COUNTA(H1989:AA1989)=0,\"\",COUNTA(H1989:AA1989))","v":""},null,null,null,null,null,null,null,null,null,null,null,null,null,null,null,null,null,null,null,null,null,null,0,{"$f":"AB1989-AB1988","v":0}]
[null,null,null,null,null,null,null,null,null,null,null,null,null,null,null,null,null,null,null,null,null,null,null,null,null,null,null,0]
[187,null,null,null,{"$f":"IF(COUNTA(H1991:AA1991)=0,\"\",COUNTA(H1991:AA1991))","v":""},null,null,null,null,null,null,null,null,null,null,null,null,null,null,null,null,null,null,null,null,null,null,0,{"$f":"AB1991-AB1990","v":0}]
[null,null,null,null,null,null,null,null,null,null,null,null,null,null,null,null,null,null,null,null,null,null,null,null,null,null,null,0]
[187,null,null,null,{"$f":"IF(COUNTA(H1993:AA1993)=0,\"\",COUNTA(H1993:AA1993))","v":""},null,null,null,null,null,null,null,null,null,null,null,null,null,null,null,null,null,null,null,null,null,null,0,{"$f":"AB1993-AB1992","v":0}]
[null,null,null,null,null,null,null,null,null,null,null,null,null,null,null,null,null,null,null,null,null,null,null,null,null,null,null,0]
[188,null,{"$f":"IF(G2612=\"\",\"\",G2612)","v":"t188"},null,{"$f":"IF(COUNTA(H1995:AA1995)=0,\"\",COUNTA(H1995:AA1995))","v":""},null,null,null,null,null,null,null,null,null,null,null,null,null,null,null,null,null,null,null,null,null,null,0,{"$f":"AB1995-AB1994","v":0}]
[null,null,null,null,null,null,null,null,null,null,null,null,null,null,null,null,null,null,null,null,null,null,null,null,null,null,null,0]
[188,null,null,null,{"$f":"IF(COUNTA(H1997:AA1997)=0,\"\",COUNTA(H1997:AA1997))","v":""},null,null,null,null,null,null,null,null,null,null,null,null,null,null,null,null,null,null,null,null,null,null,0,{"$f":"AB1997-AB1996","v":0}]
[null,null,null,null,null,null,null,null,null,null,null,null,null,null,null,null,null,null,null,null,null,null,null,null,null,null,null,0]
[188,null,null,null,{"$f":"IF(COUNTA(H1999:AA1999)=0,\"\",COUNTA(H1999:AA1999))","v":""},null,null,null,null,null,null,null,null,null,null,null,null,null,null,null,null,null,null,null,null,null,null,0,{"$f":"AB1999-AB1998","v":0}]
[null,null,null,null,null,null,null,null,null,null,null,null,null,null,null,null,null,null,null,null,null,null,null,null,null,null,null,0]
[188,null,null,null,{"$f":"IF(COUNTA(H2001:AA2001)=0,\"\",COUNTA(H2001:AA2001))","v":""},null,null,null,null,null,null,null,null,null,null,null,null,null,null,null,null,null,null,null,null,null,null,0,{"$f":"AB2001-AB2000","v":0}]
[null,null,null,null,null,null,null,null,null,null,null,null,null,null,null,null,null,null,null,null,null,null,null,null,null,null,null,0]
[188,"３",null,null,{"$f":"IF(COUNTA(H2003:AA2003)=0,\"\",COUNTA(H2003:AA2003))","v":""},null,null,null,null,null,null,null,null,null,null,null,null,null,null,null,null,null,null,null,null,null,null,0,{"$f":"AB2003-AB2002","v":0}]
[null,null,null,null,null,null,null,null,null,null,null,null,null,null,null,null,null,null,null,null,null,null,null,null,null,null,null,0]
[189,null,{"$f":"IF(G2614=\"\",\"\",G2614)","v":"t189"},null,{"$f":"IF(COUNTA(H2005:AA2005)=0,\"\",COUNTA(H2005:AA2005))","v":""},null,null,null,null,null,null,null,null,null,null,null,null,null,null,null,null,null,null,null,null,null,null,0,{"$f":"AB2005-AB2004","v":0}]
[null,null,null,null,null,null,null,null,null,null,null,null,null,null,null,null,null,null,null,null,null,null,null,null,null,null,null,0]
[189,null,null,null,{"$f":"IF(COUNTA(H2007:AA2007)=0,\"\",COUNTA(H2007:AA2007))","v":""},null,null,null,null,null,null,null,null,null,null,null,null,null,null,null,null,null,null,null,null,null,null,0,{"$f":"AB2007-AB2006","v":0}]
[null,null,null,null,null,null,null,null,null,null,null,null,null,null,null,null,null,null,null,null,null,null,null,null,null,null,null,0]
[189,null,null,null,{"$f":"IF(COUNTA(H2009:AA2009)=0,\"\",COUNTA(H2009:AA2009))","v":""},null,null,null,null,null,null,null,null,null,null,null,null,null,null,null,null,null,null,null,null,null,null,0,{"$f":"AB2009-AB2008","v":0}]
[null,null,null,null,null,null,null,null,null,null,null,null,null,null,null,null,null,null,null,null,null,null,null,null,null,null,null,0]
[189,null,null,null,{"$f":"IF(COUNTA(H2011:AA2011)=0,\"\",COUNTA(H2011:AA2011))","v":""},null,null,null,null,null,null,null,null,null,null,null,null,null,null,null,null,null,null,null,null,null,null,0,{"$f":"AB2011-AB2010","v":0}]
[null,null,null,null,null,null,null,null,null,null,null,null,null,null,null,null,null,null,null,null,null,null,null,null,null,null,null,0]
[189,null,null,null,{"$f":"IF(COUNTA(H2013:AA2013)=0,\"\",COUNTA(H2013:AA2013))","v":""},null,null,null,null,null,null,null,null,null,null,null,null,null,null,null,null,null,null,null,null,null,null,0,{"$f":"AB2013-AB2012","v":0}]
[null,null,null,null,null,null,null,null,null,null,null,null,null,null,null,null,null,null,null,null,null,null,null,null,null,null,null,0]
[190,null,{"$f":"IF(G2616=\"\",\"\",G2616)","v":"t190"},null,{"$f":"IF(COUNTA(H2015:AA2015)=0,\"\",COUNTA(H2015:AA2015))","v":""},null,null,null,null,null,null,null,null,null,null,null,null,null,null,null,null,null,null,null,null,null,null,0,{"$f":"AB2015-AB2014","v":0}]
[null,null,null,null,null,null,null,null,null,null,null,null,null,null,null,null,null,null,null,null,null,null,null,null,null,null,null,0]
[190,null,null,null,{"$f":"IF(COUNTA(H2017:AA2017)=0,\"\",COUNTA(H2017:AA2017))","v":""},null,null,null,null,null,null,null,null,null,null,null,null,null,null,null,null,null,null,null,null,null,null,0,{"$f":"AB2017-AB2016","v":0}]
[null,null,null,null,null,null,null,null,null,null,null,null,null,null,null,null,null,null,null,null,null,null,null,null,null,null,null,0]
[190,null,null,null,{"$f":"IF(COUNTA(H2019:AA2019)=0,\"\",COUNTA(H2019:AA2019))","v":""},null,null,null,null,null,null,null,null,null,null,null,null,null,null,null,null,null,null,null,null,null,null,0,{"$f":"AB2019-AB2018","v":0}]
[null,null,null,null,null,null,null,null,null,null,null,null,null,null,null,null,null,null,null,null,null,null,null,null,null,null,null,{"$f":"COUNTA(H2020:AA2020)","v":0}]
[190,null,null,null,{"$f":"IF(COUNTA(H2021:AA2021)=0,\"\",COUNTA(H2021:AA2021))","v":""},null,null,null,null,null,null,null,null,null,null,null,null,null,null,null,null,null,null,null,null,null,null,0,{"$f":"AB2021-AB2020","v":0}]
[null,null,null,null,null,null,null,null,null,null,null,null,null,null,null,null,null,null,null,null,null,null,null,null,null,null,null,0]
[190,null,null,null,{"$f":"IF(COUNTA(H2023:AA2023)=0,\"\",COUNTA(H2023:AA2023))","v":""},null,null,null,null,null,null,null,null,null,null,null,null,null,null,null,null,null,null,null,null,null,null,0,{"$f":"AB2023-AB2022","v":0}]
[null,null,null,null,null,null,null,null,null,null,null,null,null,null,null,null,null,null,null,null,null,null,null,null,null,null,null,0]
[191,null,{"$f":"IF(G2618=\"\",\"\",G2618)","v":"t191"},null,{"$f":"IF(COUNTA(H2025:AA2025)=0,\"\",COUNTA(H2025:AA2025))","v":""},null,null,null,null,null,null,null,null,null,null,null,null,null,null,null,null,null,null,null,null,null,null,0,{"$f":"AB2025-AB2024","v":0}]
[null,null,null,null,null,null,null,null,null,null,null,null,null,null,null,null,null,null,null,null,null,null,null,null,null,null,null,0]
[191,null,null,null,{"$f":"IF(COUNTA(H2027:AA2027)=0,\"\",COUNTA(H2027:AA2027))","v":""},null,null,null,null,null,null,null,null,null,null,null,null,null,null,null,null,null,null,null,null,null,null,0,{"$f":"AB2027-AB2026","v":0}]
[null,null,null,null,null,null,null,null,null,null,null,null,null,null,null,null,null,null,null,null,null,null,null,null,null,null,null,0]
[191,null,null,null,{"$f":"IF(COUNTA(H2029:AA2029)=0,\"\",COUNTA(H2029:AA2029))","v":""},null,null,null,null,null,null,null,null,null,null,null,null,null,null,null,null,null,null,null,null,null,null,0,{"$f":"AB2029-AB2028","v":0}]
[null,null,null,null,null,null,null,null,null,null,null,null,null,null,null,null,null,null,null,null,null,null,null,null,null,null,null,0]
[191,null,null,null,{"$f":"IF(COUNTA(H2031:AA2031)=0,\"\",COUNTA(H2031:AA2031))","v":""},null,null,null,null,null,null,null,null,null,null,null,null,null,null,null,null,null,null,null,null,null,null,0,{"$f":"AB2031-AB2030","v":0}]
[null,null,null,null,null,null,null,null,null,null,null,null,null,null,null,null,null,null,null,null,null,null,null,null,null,null,null,0]
[191,null,null,null,{"$f":"IF(COUNTA(H2033:AA2033)=0,\"\",COUNTA(H2033:AA2033))","v":""},null,null,null,null,null,null,null,null,null,null,null,null,null,null,null,null,null,null,null,null,null,null,0,{"$f":"AB2033-AB2032","v":0}]
[null,null,null,null,null,null,null,null,null,null,null,null,null,null,null,null,null,null,null,null,null,null,null,null,null,null,null,0]
[192,null,{"$f":"IF(G2620=\"\",\"\",G2620)","v":"t192"},null,{"$f":"IF(COUNTA(H2035:AA2035)=0,\"\",COUNTA(H2035:AA2035))","v":""},null,null,null,null,null,null,null,null,null,null,null,null,null,null,null,null,null,null,null,null,null,null,0,{"$f":"AB2035-AB2034","v":0}]
[null,null,null,null,null,null,null,null,null,null,null,null,null,null,null,null,null,null,null,null,null,null,null,null,null,null,null,0]
[192,null,null,null,{"$f":"IF(COUNTA(H2037:AA2037)=0,\"\",COUNTA(H2037:AA2037))","v":""},null,null,null,null,null,null,null,null,null,null,null,null,null,null,null,null,null,null,null,null,null,null,0,{"$f":"AB2037-AB2036","v":0}]
[null,null,null,null,null,null,null,null,null,null,null,null,null,null,null,null,null,null,null,null,null,null,null,null,null,null,null,0]
[192,null,null,null,{"$f":"IF(COUNTA(H2039:AA2039)=0,\"\",COUNTA(H2039:AA2039))","v":""},null,null,null,null,null,null,null,null,null,null,null,null,null,null,null,null,null,null,null,null,null,null,0,{"$f":"AB2039-AB2038","v":0}]
[null,null,null,null,null,null,null,null,null,null,null,null,null,null,null,null,null,null,null,null,null,null,null,null,null,null,null,0]
[192,null,null,null,{"$f":"IF(COUNTA(H2041:AA2041)=0,\"\",COUNTA(H2041:AA2041))","v":""},null,null,null,null,null,null,null,null,null,null,null,null,null,null,null,null,null,null,null,null,null,null,0,{"$f":"AB2041-AB2040","v":0}]
[null,null,null,null,null,null,null,null,null,null,null,null,null,null,null,null,null,null,null,null,null,null,null,null,null,null,null,0]
[192,null,null,null,{"$f":"IF(COUNTA(H2043:AA2043)=0,\"\",COUNTA(H2043:AA2043))","v":""},null,null,null,null,null,null,null,null,null,null,null,null,null,null,null,null,null,null,null,null,null,null,0,{"$f":"AB2043-AB2042","v":0}]
[null,"専",null,null,null,null,null,null,null,null,null,null,null,null,null,null,null,null,null,null,null,null,null,null,null,null,null,0]
[193,null,{"$f":"IF(G2622=\"\",\"\",G2622)","v":"t193"},null,{"$f":"IF(COUNTA(H2045:AA2045)=0,\"\",COUNTA(H2045:AA2045))","v":""},null,null,null,null,null,null,null,null,null,null,null,null,null,null,null,null,null,null,null,null,null,null,0,{"$f":"AB2045-AB2044","v":0}]
[null,null,null,null,null,null,null,null,null,null,null,null,null,null,null,null,null,null,null,null,null,null,null,null,null,null,null,0]
[193,null,null,null,{"$f":"IF(COUNTA(H2047:AA2047)=0,\"\",COUNTA(H2047:AA2047))","v":""},null,null,null,null,null,null,null,null,null,null,null,null,null,null,null,null,null,null,null,null,null,null,0,{"$f":"AB2047-AB2046","v":0}]
[null,null,null,null,null,null,null,null,null,null,null,null,null,null,null,null,null,null,null,null,null,null,null,null,null,null,null,0]
[193,null,null,null,{"$f":"IF(COUNTA(H2049:AA2049)=0,\"\",COUNTA(H2049:AA2049))","v":""},null,null,null,null,null,null,null,null,null,null,null,null,null,null,null,null,null,null,null,null,null,null,0,{"$f":"AB2049-AB2048","v":0}]
[null,null,null,null,null,null,null,null,null,null,null,null,null,null,null,null,null,null,null,null,null,null,null,null,null,null,null,0]
[193,null,null,null,{"$f":"IF(COUNTA(H2051:AA2051)=0,\"\",COUNTA(H2051:AA2051))","v":""},null,null,null,null,null,null,null,null,null,null,null,null,null,null,null,null,null,null,null,null,null,null,0,{"$f":"AB2051-AB2050","v":0}]
[null,null,null,null,null,null,null,null,null,null,null,null,null,null,null,null,null,null,null,null,null,null,null,null,null,null,null,0]
[193,null,null,null,{"$f":"IF(COUNTA(H2053:AA2053)=0,\"\",COUNTA(H2053:AA2053))","v":""},null,null,null,null,null,null,null,null,null,null,null,null,null,null,null,null,null,null,null,null,null,null,0,{"$f":"AB2053-AB2052","v":0}]
[null,null,null,null,null,null,null,null,null,null,null,null,null,null,null,null,null,null,null,null,null,null,null,null,null,null,null,0]
[194,null,{"$f":"IF(G2624=\"\",\"\",G2624)","v":"t194"},null,{"$f":"IF(COUNTA(H2055:AA2055)=0,\"\",COUNTA(H2055:AA2055))","v":""},null,null,null,null,null,null,null,null,null,null,null,null,null,null,null,null,null,null,null,null,null,null,0,{"$f":"AB2055-AB2054","v":0}]
[null,null,null,null,null,null,null,null,null,null,null,null,null,null,null,null,null,null,null,null,null,null,null,null,null,null,null,0]
[194,null,null,null,{"$f":"IF(COUNTA(H2057:AA2057)=0,\"\",COUNTA(H2057:AA2057))","v":""},null,null,null,null,null,null,null,null,null,null,null,null,null,null,null,null,null,null,null,null,null,null,0,{"$f":"AB2057-AB2056","v":0}]
[null,null,null,null,null,null,null,null,null,null,null,null,null,null,null,null,null,null,null,null,null,null,null,null,null,null,null,0]
[194,null,null,null,{"$f":"IF(COUNTA(H2059:AA2059)=0,\"\",COUNTA(H2059:AA2059))","v":""},null,null,null,null,null,null,null,null,null,null,null,null,null,null,null,null,null,null,null,null,null,null,0,{"$f":"AB2059-AB2058","v":0}]
[null,null,null,null,null,null,null,null,null,null,null,null,null,null,null,null,null,null,null,null,null,null,null,null,null,null,null,0]
[194,null,null,null,{"$f":"IF(COUNTA(H2061:AA2061)=0,\"\",COUNTA(H2061:AA2061))","v":""},null,null,null,null,null,null,null,null,null,null,null,null,null,null,null,null,null,null,null,null,null,null,0,{"$f":"AB2061-AB2060","v":0}]
[null,null,null,null,null,null,null,null,null,null,null,null,null,null,null,null,null,null,null,null,null,null,null,null,null,null,null,0]
[194,null,null,null,{"$f":"IF(COUNTA(H2063:AA2063)=0,\"\",COUNTA(H2063:AA2063))","v":""},null,null,null,null,null,null,null,null,null,null,null,null,null,null,null,null,null,null,null,null,null,null,0,{"$f":"AB2063-AB2062","v":0}]
[null,null,null,null,null,null,null,null,null,null,null,null,null,null,null,null,null,null,null,null,null,null,null,null,null,null,null,0]
[195,null,{"$f":"IF(G2626=\"\",\"\",G2626)","v":"t195"},null,{"$f":"IF(COUNTA(H2065:AA2065)=0,\"\",COUNTA(H2065:AA2065))","v":""},null,null,null,null,null,null,null,null,null,null,null,null,null,null,null,null,null,null,null,null,null,null,0,{"$f":"AB2065-AB2064","v":0}]
[null,null,null,null,null,null,null,null,null,null,null,null,null,null,null,null,null,null,null,null,null,null,null,null,null,null,null,0]
[195,null,null,null,{"$f":"IF(COUNTA(H2067:AA2067)=0,\"\",COUNTA(H2067:AA2067))","v":""},null,null,null,null,null,null,null,null,null,null,null,null,null,null,null,null,null,null,null,null,null,null,0,{"$f":"AB2067-AB2066","v":0}]
[null,null,null,null,null,null,null,null,null,null,null,null,null,null,null,null,null,null,null,null,null,null,null,null,null,null,null,0]
[195,null,null,null,{"$f":"IF(COUNTA(H2069:AA2069)=0,\"\",COUNTA(H2069:AA2069))","v":""},null,null,null,null,null,null,null,null,null,null,null,null,null,null,null,null,null,null,null,null,null,null,0,{"$f":"AB2069-AB2068","v":0}]
[null,null,null,null,null,null,null,null,null,null,null,null,null,null,null,null,null,null,null,null,null,null,null,null,null,null,null,0]
[195,null,null,null,{"$f":"IF(COUNTA(H2071:AA2071)=0,\"\",COUNTA(H2071:AA2071))","v":""},null,null,null,null,null,null,null,null,null,null,null,null,null,null,null,null,null,null,null,null,null,null,0,{"$f":"AB2071-AB2070","v":0}]
[null,null,null,null,null,null,null,null,null,null,null,null,null,null,null,null,null,null,null,null,null,null,null,null,null,null,null,0]
[195,"門",null,null,{"$f":"IF(COUNTA(H2073:AA2073)=0,\"\",COUNTA(H2073:AA2073))","v":""},null,null,null,null,null,null,null,null,null,null,null,null,null,null,null,null,null,null,null,null,null,null,0,{"$f":"AB2073-AB2072","v":0}]
[null,null,null,null,null,null,null,null,null,null,null,null,null,null,null,null,null,null,null,null,null,null,null,null,null,null,null,0]
[196,null,{"$f":"IF(G2628=\"\",\"\",G2628)","v":"t196"},null,{"$f":"IF(COUNTA(H2075:AA2075)=0,\"\",COUNTA(H2075:AA2075))","v":""},null,null,null,null,null,null,null,null,null,null,null,null,null,null,null,null,null,null,null,null,null,null,0,{"$f":"AB2075-AB2074","v":0}]
[null,null,null,null,null,null,null,null,null,null,null,null,null,null,null,null,null,null,null,null,null,null,null,null,null,null,null,0]
[196,null,null,null,{"$f":"IF(COUNTA(H2077:AA2077)=0,\"\",COUNTA(H2077:AA2077))","v":""},null,null,null,null,null,null,null,null,null,null,null,null,null,null,null,null,null,null,null,null,null,null,0,{"$f":"AB2077-AB2076","v":0}]
[null,null,null,null,null,null,null,null,null,null,null,null,null,null,null,null,null,null,null,null,null,null,null,null,null,null,null,0]
[196,null,null,null,{"$f":"IF(COUNTA(H2079:AA2079)=0,\"\",COUNTA(H2079:AA2079))","v":""},null,null,null,null,null,null,null,null,null,null,null,null,null,null,null,null,null,null,null,null,null,null,0,{"$f":"AB2079-AB2078","v":0}]
[null,null,null,null,null,null,null,null,null,null,null,null,null,null,null,null,null,null,null,null,null,null,null,null,null,null,null,0]
[196,null,null,null,{"$f":"IF(COUNTA(H2081:AA2081)=0,\"\",COUNTA(H2081:AA2081))","v":""},null,null,null,null,null,null,null,null,null,null,null,null,null,null,null,null,null,null,null,null,null,null,0,{"$f":"AB2081-AB2080","v":0}]
[null,null,null,null,null,null,null,null,null,null,null,null,null,null,null,null,null,null,null,null,null,null,null,null,null,null,null,0]
[196,null,null,null,{"$f":"IF(COUNTA(H2083:AA2083)=0,\"\",COUNTA(H2083:AA2083))","v":""},null,null,null,null,null,null,null,null,null,null,null,null,null,null,null,null,null,null,null,null,null,null,0,{"$f":"AB2083-AB2082","v":0}]
[null,null,null,null,null,null,null,null,null,null,null,null,null,null,null,null,null,null,null,null,null,null,null,null,null,null,null,{"$f":"COUNTA(H2084:AA2084)","v":0}]
[197,null,{"$f":"IF(G2630=\"\",\"\",G2630)","v":"t197"},null,{"$f":"IF(COUNTA(H2085:AA2085)=0,\"\",COUNTA(H2085:AA2085))","v":""},null,null,null,null,null,null,null,null,null,null,null,null,null,null,null,null,null,null,null,null,null,null,0,{"$f":"AB2085-AB2084","v":0}]
[null,null,null,null,null,null,null,null,null,null,null,null,null,null,null,null,null,null,null,null,null,null,null,null,null,null,null,0]
[197,null,null,null,{"$f":"IF(COUNTA(H2087:AA2087)=0,\"\",COUNTA(H2087:AA2087))","v":""},null,null,null,null,null,null,null,null,null,null,null,null,null,null,null,null,null,null,null,null,null,null,0,{"$f":"AB2087-AB2086","v":0}]
[null,null,null,null,null,null,null,null,null,null,null,null,null,null,null,null,null,null,null,null,null,null,null,null,null,null,null,0]
[197,null,null,null,{"$f":"IF(COUNTA(H2089:AA2089)=0,\"\",COUNTA(H2089:AA2089))","v":""},null,null,null,null,null,null,null,null,null,null,null,null,null,null,null,null,null,null,null,null,null,null,0,{"$f":"AB2089-AB2088","v":0}]
[null,null,null,null,null,null,null,null,null,null,null,null,null,null,null,null,null,null,null,null,null,null,null,null,null,null,null,0]
[197,null,null,null,{"$f":"IF(COUNTA(H2091:AA2091)=0,\"\",COUNTA(H2091:AA2091))","v":""},null,null,null,null,null,null,null,null,null,null,null,null,null,null,null,null,null,null,null,null,null,null,0,{"$f":"AB2091-AB2090","v":0}]
[null,null,null,null,null,null,null,null,null,null,null,null,null,null,null,null,null,null,null,null,null,null,null,null,null,null,null,0]
[197,null,null,null,{"$f":"IF(COUNTA(H2093:AA2093)=0,\"\",COUNTA(H2093:AA2093))","v":""},null,null,null,null,null,null,null,null,null,null,null,null,null,null,null,null,null,null,null,null,null,null,0,{"$f":"AB2093-AB2092","v":0}]
[null,null,null,null,null,null,null,null,null,null,null,null,null,null,null,null,null,null,null,null,null,null,null,null,null,null,null,0]
[198,null,{"$f":"IF(G2632=\"\",\"\",G2632)","v":"t198"},null,{"$f":"IF(COUNTA(H2095:AA2095)=0,\"\",COUNTA(H2095:AA2095))","v":""},null,null,null,null,null,null,null,null,null,null,null,null,null,null,null,null,null,null,null,null,null,null,0,{"$f":"AB2095-AB2094","v":0}]
[null,null,null,null,null,null,null,null,null,null,null,null,null,null,null,null,null,null,null,null,null,null,null,null,null,null,null,0]
[198,null,null,null,{"$f":"IF(COUNTA(H2097:AA2097)=0,\"\",COUNTA(H2097:AA2097))","v":""},null,null,null,null,null,null,null,null,null,null,null,null,null,null,null,null,null,null,null,null,null,null,0,{"$f":"AB2097-AB2096","v":0}]
[null,null,null,null,null,null,null,null,null,null,null,null,null,null,null,null,null,null,null,null,null,null,null,null,null,null,null,0]
[198,null,null,null,{"$f":"IF(COUNTA(H2099:AA2099)=0,\"\",COUNTA(H2099:AA2099))","v":""},null,null,null,null,null,null,null,null,null,null,null,null,null,null,null,null,null,null,null,null,null,null,0,{"$f":"AB2099-AB2098","v":0}]
[null,null,null,null,null,null,null,null,null,null,null,null,null,null,null,null,null,null,null,null,null,null,null,null,null,null,null,0]
[198,null,null,null,{"$f":"IF(COUNTA(H2101:AA2101)=0,\"\",COUNTA(H2101:AA2101))","v":""},null,null,null,null,null,null,null,null,null,null,null,null,null,null,null,null,null,null,null,null,null,null,0,{"$f":"AB2101-AB2100","v":0}]
[null,null,null,null,null,null,null,null,null,null,null,null,null,null,null,null,null,null,null,null,null,null,null,null,null,null,null,0]
[198,"４",null,null,{"$f":"IF(COUNTA(H2103:AA2103)=0,\"\",COUNTA(H2103:AA2103))","v":""},null,null,null,null,null,null,null,null,null,null,null,null,null,null,null,null,null,null,null,null,null,null,0,{"$f":"AB2103-AB2102","v":0}]
[null,null,null,null,null,null,null,null,null,null,null,null,null,null,null,null,null,null,null,null,null,null,null,null,null,null,null,0]
[199,null,{"$f":"IF(G2634=\"\",\"\",G2634)","v":"t199"},null,{"$f":"IF(COUNTA(H2105:AA2105)=0,\"\",COUNTA(H2105:AA2105))","v":""},null,null,null,null,null,null,null,null,null,null,null,null,null,null,null,null,null,null,null,null,null,null,0,{"$f":"AB2105-AB2104","v":0}]
[null,null,null,null,null,null,null,null,null,null,null,null,null,null,null,null,null,null,null,null,null,null,null,null,null,null,null,0]
[199,null,null,null,{"$f":"IF(COUNTA(H2107:AA2107)=0,\"\",COUNTA(H2107:AA2107))","v":""},null,null,null,null,null,null,null,null,null,null,null,null,null,null,null,null,null,null,null,null,null,null,0,{"$f":"AB2107-AB2106","v":0}]
[null,null,null,null,null,null,null,null,null,null,null,null,null,null,null,null,null,null,null,null,null,null,null,null,null,null,null,0]
[199,null,null,null,{"$f":"IF(COUNTA(H2109:AA2109)=0,\"\",COUNTA(H2109:AA2109))","v":""},null,null,null,null,null,null,null,null,null,null,null,null,null,null,null,null,null,null,null,null,null,null,0,{"$f":"AB2109-AB2108","v":0}]
[null,null,null,null,null,null,null,null,null,null,null,null,null,null,null,null,null,null,null,null,null,null,null,null,null,null,null,0]
[199,null,null,null,{"$f":"IF(COUNTA(H2111:AA2111)=0,\"\",COUNTA(H2111:AA2111))","v":""},null,null,null,null,null,null,null,null,null,null,null,null,null,null,null,null,null,null,null,null,null,null,0,{"$f":"AB2111-AB2110","v":0}]
[null,null,null,null,null,null,null,null,null,null,null,null,null,null,null,null,null,null,null,null,null,null,null,null,null,null,null,0]
[199,null,null,null,{"$f":"IF(COUNTA(H2113:AA2113)=0,\"\",COUNTA(H2113:AA2113))","v":""},null,null,null,null,null,null,null,null,null,null,null,null,null,null,null,null,null,null,null,null,null,null,0,{"$f":"AB2113-AB2112","v":0}]
[null,null,null,null,null,null,null,null,null,null,null,null,null,null,null,null,null,null,null,null,null,null,null,null,null,null,null,0]
[200,null,{"$f":"IF(G2636=\"\",\"\",G2636)","v":"t200"},null,{"$f":"IF(COUNTA(H2115:AA2115)=0,\"\",COUNTA(H2115:AA2115))","v":""},null,null,null,null,null,null,null,null,null,null,null,null,null,null,null,null,null,null,null,null,null,null,0,{"$f":"AB2115-AB2114","v":0}]
[null,null,null,null,null,null,null,null,null,null,null,null,null,null,null,null,null,null,null,null,null,null,null,null,null,null,null,0]
[200,null,null,null,{"$f":"IF(COUNTA(H2117:AA2117)=0,\"\",COUNTA(H2117:AA2117))","v":""},null,null,null,null,null,null,null,null,null,null,null,null,null,null,null,null,null,null,null,null,null,null,0,{"$f":"AB2117-AB2116","v":0}]
[null,null,null,null,null,null,null,null,null,null,null,null,null,null,null,null,null,null,null,null,null,null,null,null,null,null,null,0]
[200,null,null,null,{"$f":"IF(COUNTA(H2119:AA2119)=0,\"\",COUNTA(H2119:AA2119))","v":""},null,null,null,null,null,null,null,null,null,null,null,null,null,null,null,null,null,null,null,null,null,null,0,{"$f":"AB2119-AB2118","v":0}]
[null,null,null,null,null,null,null,null,null,null,null,null,null,null,null,null,null,null,null,null,null,null,null,null,null,null,null,0]
[200,null,null,null,{"$f":"IF(COUNTA(H2121:AA2121)=0,\"\",COUNTA(H2121:AA2121))","v":""},null,null,null,null,null,null,null,null,null,null,null,null,null,null,null,null,null,null,null,null,null,null,0,{"$f":"AB2121-AB2120","v":0}]
[null,null,null,null,null,null,null,null,null,null,null,null,null,null,null,null,null,null,null,null,null,null,null,null,null,null,null,0]
[200,null,null,null,{"$f":"IF(COUNTA(H2123:AA2123)=0,\"\",COUNTA(H2123:AA2123))","v":""},null,null,null,null,null,null,null,null,null,null,null,null,null,null,null,null,null,null,null,null,null,null,0,{"$f":"AB2123-AB2122","v":0}]
[null,null,null,null,null,null,null,null,null,null,null,null,null,null,null,null,null,null,null,null,null,null,null,null,null,null,null,0]
[201,null,{"$f":"IF(G2638=\"\",\"\",G2638)","v":"t201"},null,{"$f":"IF(COUNTA(H2125:AA2125)=0,\"\",COUNTA(H2125:AA2125))","v":""},null,null,null,null,null,null,null,null,null,null,null,null,null,null,null,null,null,null,null,null,null,null,0,{"$f":"AB2125-AB2124","v":0}]
[null,null,null,null,null,null,null,null,null,null,null,null,null,null,null,null,null,null,null,null,null,null,null,null,null,null,null,0]
[201,null,null,null,{"$f":"IF(COUNTA(H2127:AA2127)=0,\"\",COUNTA(H2127:AA2127))","v":""},null,null,null,null,null,null,null,null,null,null,null,null,null,null,null,null,null,null,null,null,null,null,0,{"$f":"AB2127-AB2126","v":0}]
[null,null,null,null,null,null,null,null,null,null,null,null,null,null,null,null,null,null,null,null,null,null,null,null,null,null,null,0]
[201,null,null,null,{"$f":"IF(COUNTA(H2129:AA2129)=0,\"\",COUNTA(H2129:AA2129))","v":""},null,null,null,null,null,null,null,null,null,null,null,null,null,null,null,null,null,null,null,null,null,null,0,{"$f":"AB2129-AB2128","v":0}]
[null,null,null,null,null,null,null,null,null,null,null,null,null,null,null,null,null,null,null,null,null,null,null,null,null,null,null,0]
[201,null,null,null,{"$f":"IF(COUNTA(H2131:AA2131)=0,\"\",COUNTA(H2131:AA2131))","v":""},null,null,null,null,null,null,null,null,null,null,null,null,null,null,null,null,null,null,null,null,null,null,0,{"$f":"AB2131-AB2130","v":0}]
[null,null,null,null,null,null,null,null,null,null,null,null,null,null,null,null,null,null,null,null,null,null,null,null,null,null,null,0]
[201,null,null,null,{"$f":"IF(COUNTA(H2133:AA2133)=0,\"\",COUNTA(H2133:AA2133))","v":""},null,null,null,null,null,null,null,null,null,null,null,null,null,null,null,null,null,null,null,null,null,null,0,{"$f":"AB2133-AB2132","v":0}]
[null,null,null,null,null,null,null,null,null,null,null,null,null,null,null,null,null,null,null,null,null,null,null,null,null,null,null,0]
[202,null,{"$f":"IF(G2640=\"\",\"\",G2640)","v":"t202"},null,{"$f":"IF(COUNTA(H2135:AA2135)=0,\"\",COUNTA(H2135:AA2135))","v":""},null,null,null,null,null,null,null,null,null,null,null,null,null,null,null,null,null,null,null,null,null,null,0,{"$f":"AB2135-AB2134","v":0}]
[null,null,null,null,null,null,null,null,null,null,null,null,null,null,null,null,null,null,null,null,null,null,null,null,null,null,null,0]
[202,null,null,null,{"$f":"IF(COUNTA(H2137:AA2137)=0,\"\",COUNTA(H2137:AA2137))","v":""},null,null,null,null,null,null,null,null,null,null,null,null,null,null,null,null,null,null,null,null,null,null,0,{"$f":"AB2137-AB2136","v":0}]
[null,null,null,null,null,null,null,null,null,null,null,null,null,null,null,null,null,null,null,null,null,null,null,null,null,null,null,0]
[202,null,null,null,{"$f":"IF(COUNTA(H2139:AA2139)=0,\"\",COUNTA(H2139:AA2139))","v":""},null,null,null,null,null,null,null,null,null,null,null,null,null,null,null,null,null,null,null,null,null,null,0,{"$f":"AB2139-AB2138","v":0}]
[null,null,null,null,null,null,null,null,null,null,null,null,null,null,null,null,null,null,null,null,null,null,null,null,null,null,null,0]
[202,null,null,null,{"$f":"IF(COUNTA(H2141:AA2141)=0,\"\",COUNTA(H2141:AA2141))","v":""},null,null,null,null,null,null,null,null,null,null,null,null,null,null,null,null,null,null,null,null,null,null,0,{"$f":"AB2141-AB2140","v":0}]
[null,null,null,null,null,null,null,null,null,null,null,null,null,null,null,null,null,null,null,null,null,null,null,null,null,null,null,0]
[202,null,null,null,{"$f":"IF(COUNTA(H2143:AA2143)=0,\"\",COUNTA(H2143:AA2143))","v":""},null,null,null,null,null,null,null,null,null,null,null,null,null,null,null,null,null,null,null,null,null,null,0,{"$f":"AB2143-AB2142","v":0}]
[null,"専",null,null,null,null,null,null,null,null,null,null,null,null,null,null,null,null,null,null,null,null,null,null,null,null,null,0]
[203,null,{"$f":"IF(G2642=\"\",\"\",G2642)","v":"t203"},null,{"$f":"IF(COUNTA(H2145:AA2145)=0,\"\",COUNTA(H2145:AA2145))","v":""},null,null,null,null,null,null,null,null,null,null,null,null,null,null,null,null,null,null,null,null,null,null,0,{"$f":"AB2145-AB2144","v":0}]
[null,null,null,null,null,null,null,null,null,null,null,null,null,null,null,null,null,null,null,null,null,null,null,null,null,null,null,0]
[203,null,null,null,{"$f":"IF(COUNTA(H2147:AA2147)=0,\"\",COUNTA(H2147:AA2147))","v":""},null,null,null,null,null,null,null,null,null,null,null,null,null,null,null,null,null,null,null,null,null,null,0,{"$f":"AB2147-AB2146","v":0}]
[null,null,null,null,null,null,null,null,null,null,null,null,null,null,null,null,null,null,null,null,null,null,null,null,null,null,null,{"$f":"COUNTA(H2148:AA2148)","v":0}]
[203,null,null,null,{"$f":"IF(COUNTA(H2149:AA2149)=0,\"\",COUNTA(H2149:AA2149))","v":""},null,null,null,null,null,null,null,null,null,null,null,null,null,null,null,null,null,null,null,null,null,null,0,{"$f":"AB2149-AB2148","v":0}]
[null,null,null,null,null,null,null,null,null,null,null,null,null,null,null,null,null,null,null,null,null,null,null,null,null,null,null,0]
[203,null,null,null,{"$f":"IF(COUNTA(H2151:AA2151)=0,\"\",COUNTA(H2151:AA2151))","v":""},null,null,null,null,null,null,null,null,null,null,null,null,null,null,null,null,null,null,null,null,null,null,0,{"$f":"AB2151-AB2150","v":0}]
[null,null,null,null,null,null,null,null,null,null,null,null,null,null,null,null,null,null,null,null,null,null,null,null,null,null,null,0]
[203,null,null,null,{"$f":"IF(COUNTA(H2153:AA2153)=0,\"\",COUNTA(H2153:AA2153))","v":""},null,null,null,null,null,null,null,null,null,null,null,null,null,null,null,null,null,null,null,null,null,null,0,{"$f":"AB2153-AB2152","v":0}]
[null,null,null,null,null,null,null,null,null,null,null,null,null,null,null,null,null,null,null,null,null,null,null,null,null,null,null,0]
[204,null,{"$f":"IF(G2644=\"\",\"\",G2644)","v":"t204"},null,{"$f":"IF(COUNTA(H2155:AA2155)=0,\"\",COUNTA(H2155:AA2155))","v":""},null,null,null,null,null,null,null,null,null,null,null,null,null,null,null,null,null,null,null,null,null,null,0,{"$f":"AB2155-AB2154","v":0}]
[null,null,null,null,null,null,null,null,null,null,null,null,null,null,null,null,null,null,null,null,null,null,null,null,null,null,null,0]
[204,null,null,null,{"$f":"IF(COUNTA(H2157:AA2157)=0,\"\",COUNTA(H2157:AA2157))","v":""},null,null,null,null,null,null,null,null,null,null,null,null,null,null,null,null,null,null,null,null,null,null,0,{"$f":"AB2157-AB2156","v":0}]
[null,null,null,null,null,null,null,null,null,null,null,null,null,null,null,null,null,null,null,null,null,null,null,null,null,null,null,0]
[204,null,null,null,{"$f":"IF(COUNTA(H2159:AA2159)=0,\"\",COUNTA(H2159:AA2159))","v":""},null,null,null,null,null,null,null,null,null,null,null,null,null,null,null,null,null,null,null,null,null,null,0,{"$f":"AB2159-AB2158","v":0}]
[null,null,null,null,null,null,null,null,null,null,null,null,null,null,null,null,null,null,null,null,null,null,null,null,null,null,null,0]
[204,null,null,null,{"$f":"IF(COUNTA(H2161:AA2161)=0,\"\",COUNTA(H2161:AA2161))","v":""},null,null,null,null,null,null,null,null,null,null,null,null,null,null,null,null,null,null,null,null,null,null,0,{"$f":"AB2161-AB2160","v":0}]
[null,null,null,null,null,null,null,null,null,null,null,null,null,null,null,null,null,null,null,null,null,null,null,null,null,null,null,0]
[204,null,null,null,{"$f":"IF(COUNTA(H2163:AA2163)=0,\"\",COUNTA(H2163:AA2163))","v":""},null,null,null,null,null,null,null,null,null,null,null,null,null,null,null,null,null,null,null,null,null,null,0,{"$f":"AB2163-AB2162","v":0}]
[null,null,null,null,null,null,null,null,null,null,null,null,null,null,null,null,null,null,null,null,null,null,null,null,null,null,null,0]
[205,null,{"$f":"IF(G2646=\"\",\"\",G2646)","v":"t205"},null,{"$f":"IF(COUNTA(H2165:AA2165)=0,\"\",COUNTA(H2165:AA2165))","v":""},null,null,null,null,null,null,null,null,null,null,null,null,null,null,null,null,null,null,null,null,null,null,0,{"$f":"AB2165-AB2164","v":0}]
[null,null,null,null,null,null,null,null,null,null,null,null,null,null,null,null,null,null,null,null,null,null,null,null,null,null,null,0]
[205,null,null,null,{"$f":"IF(COUNTA(H2167:AA2167)=0,\"\",COUNTA(H2167:AA2167))","v":""},null,null,null,null,null,null,null,null,null,null,null,null,null,null,null,null,null,null,null,null,null,null,0,{"$f":"AB2167-AB2166","v":0}]
[null,null,null,null,null,null,null,null,null,null,null,null,null,null,null,null,null,null,null,null,null,null,null,null,null,null,null,0]
[205,null,null,null,{"$f":"IF(COUNTA(H2169:AA2169)=0,\"\",COUNTA(H2169:AA2169))","v":""},null,null,null,null,null,null,null,null,null,null,null,null,null,null,null,null,null,null,null,null,null,null,0,{"$f":"AB2169-AB2168","v":0}]
[null,null,null,null,null,null,null,null,null,null,null,null,null,null,null,null,null,null,null,null,null,null,null,null,null,null,null,0]
[205,null,null,null,{"$f":"IF(COUNTA(H2171:AA2171)=0,\"\",COUNTA(H2171:AA2171))","v":""},null,null,null,null,null,null,null,null,null,null,null,null,null,null,null,null,null,null,null,null,null,null,0,{"$f":"AB2171-AB2170","v":0}]
[null,null,null,null,null,null,null,null,null,null,null,null,null,null,null,null,null,null,null,null,null,null,null,null,null,null,null,0]
[205,"門",null,null,{"$f":"IF(COUNTA(H2173:AA2173)=0,\"\",COUNTA(H2173:AA2173))","v":""},null,null,null,null,null,null,null,null,null,null,null,null,null,null,null,null,null,null,null,null,null,null,0,{"$f":"AB2173-AB2172","v":0}]
[null,null,null,null,null,null,null,null,null,null,null,null,null,null,null,null,null,null,null,null,null,null,null,null,null,null,null,0]
[206,null,{"$f":"IF(G2648=\"\",\"\",G2648)","v":"t206"},null,{"$f":"IF(COUNTA(H2175:AA2175)=0,\"\",COUNTA(H2175:AA2175))","v":""},null,null,null,null,null,null,null,null,null,null,null,null,null,null,null,null,null,null,null,null,null,null,0,{"$f":"AB2175-AB2174","v":0}]
[null,null,null,null,null,null,null,null,null,null,null,null,null,null,null,null,null,null,null,null,null,null,null,null,null,null,null,0]
[206,null,null,null,{"$f":"IF(COUNTA(H2177:AA2177)=0,\"\",COUNTA(H2177:AA2177))","v":""},null,null,null,null,null,null,null,null,null,null,null,null,null,null,null,null,null,null,null,null,null,null,0,{"$f":"AB2177-AB2176","v":0}]
[null,null,null,null,null,null,null,null,null,null,null,null,null,null,null,null,null,null,null,null,null,null,null,null,null,null,null,0]
[206,null,null,null,{"$f":"IF(COUNTA(H2179:AA2179)=0,\"\",COUNTA(H2179:AA2179))","v":""},null,null,null,null,null,null,null,null,null,null,null,null,null,null,null,null,null,null,null,null,null,null,0,{"$f":"AB2179-AB2178","v":0}]
[null,null,null,null,null,null,null,null,null,null,null,null,null,null,null,null,null,null,null,null,null,null,null,null,null,null,null,0]
[206,null,null,null,{"$f":"IF(COUNTA(H2181:AA2181)=0,\"\",COUNTA(H2181:AA2181))","v":""},null,null,null,null,null,null,null,null,null,null,null,null,null,null,null,null,null,null,null,null,null,null,0,{"$f":"AB2181-AB2180","v":0}]
[null,null,null,null,null,null,null,null,null,null,null,null,null,null,null,null,null,null,null,null,null,null,null,null,null,null,null,0]
[206,null,null,null,{"$f":"IF(COUNTA(H2183:AA2183)=0,\"\",COUNTA(H2183:AA2183))","v":""},null,null,null,null,null,null,null,null,null,null,null,null,null,null,null,null,null,null,null,null,null,null,0,{"$f":"AB2183-AB2182","v":0}]
[null,null,null,null,null,null,null,null,null,null,null,null,null,null,null,null,null,null,null,null,null,null,null,null,null,null,null,0]
[207,null,{"$f":"IF(G2650=\"\",\"\",G2650)","v":"t207"},null,{"$f":"IF(COUNTA(H2185:AA2185)=0,\"\",COUNTA(H2185:AA2185))","v":""},null,null,null,null,null,null,null,null,null,null,null,null,null,null,null,null,null,null,null,null,null,null,0,{"$f":"AB2185-AB2184","v":0}]
[null,null,null,null,null,null,null,null,null,null,null,null,null,null,null,null,null,null,null,null,null,null,null,null,null,null,null,0]
[207,null,null,null,{"$f":"IF(COUNTA(H2187:AA2187)=0,\"\",COUNTA(H2187:AA2187))","v":""},null,null,null,null,null,null,null,null,null,null,null,null,null,null,null,null,null,null,null,null,null,null,0,{"$f":"AB2187-AB2186","v":0}]
[null,null,null,null,null,null,null,null,null,null,null,null,null,null,null,null,null,null,null,null,null,null,null,null,null,null,null,0]
[207,null,null,null,{"$f":"IF(COUNTA(H2189:AA2189)=0,\"\",COUNTA(H2189:AA2189))","v":""},null,null,null,null,null,null,null,null,null,null,null,null,null,null,null,null,null,null,null,null,null,null,0,{"$f":"AB2189-AB2188","v":0}]
[null,null,null,null,null,null,null,null,null,null,null,null,null,null,null,null,null,null,null,null,null,null,null,null,null,null,null,0]
[207,null,null,null,{"$f":"IF(COUNTA(H2191:AA2191)=0,\"\",COUNTA(H2191:AA2191))","v":""},null,null,null,null,null,null,null,null,null,null,null,null,null,null,null,null,null,null,null,null,null,null,0,{"$f":"AB2191-AB2190","v":0}]
[null,null,null,null,null,null,null,null,null,null,null,null,null,null,null,null,null,null,null,null,null,null,null,null,null,null,null,0]
[207,null,null,null,{"$f":"IF(COUNTA(H2193:AA2193)=0,\"\",COUNTA(H2193:AA2193))","v":""},null,null,null,null,null,null,null,null,null,null,null,null,null,null,null,null,null,null,null,null,null,null,0,{"$f":"AB2193-AB2192","v":0}]
[null,null,null,null,null,null,null,null,null,null,null,null,null,null,null,null,null,null,null,null,null,null,null,null,null,null,null,0]
[208,null,{"$f":"IF(G2652=\"\",\"\",G2652)","v":"t208"},null,{"$f":"IF(COUNTA(H2195:AA2195)=0,\"\",COUNTA(H2195:AA2195))","v":""},null,null,null,null,null,null,null,null,null,null,null,null,null,null,null,null,null,null,null,null,null,null,0,{"$f":"AB2195-AB2194","v":0}]
[null,null,null,null,null,null,null,null,null,null,null,null,null,null,null,null,null,null,null,null,null,null,null,null,null,null,null,0]
[208,null,null,null,{"$f":"IF(COUNTA(H2197:AA2197)=0,\"\",COUNTA(H2197:AA2197))","v":""},null,null,null,null,null,null,null,null,null,null,null,null,null,null,null,null,null,null,null,null,null,null,0,{"$f":"AB2197-AB2196","v":0}]
[null,null,null,null,null,null,null,null,null,null,null,null,null,null,null,null,null,null,null,null,null,null,null,null,null,null,null,0]
[208,null,null,null,{"$f":"IF(COUNTA(H2199:AA2199)=0,\"\",COUNTA(H2199:AA2199))","v":""},null,null,null,null,null,null,null,null,null,null,null,null,null,null,null,null,null,null,null,null,null,null,0,{"$f":"AB2199-AB2198","v":0}]
[null,null,null,null,null,null,null,null,null,null,null,null,null,null,null,null,null,null,null,null,null,null,null,null,null,null,null,0]
[208,null,null,null,{"$f":"IF(COUNTA(H2201:AA2201)=0,\"\",COUNTA(H2201:AA2201))","v":""},null,null,null,null,null,null,null,null,null,null,null,null,null,null,null,null,null,null,null,null,null,null,0,{"$f":"AB2201-AB2200","v":0}]
[null,null,null,null,null,null,null,null,null,null,null,null,null,null,null,null,null,null,null,null,null,null,null,null,null,null,null,0]
[208,"５",null,null,{"$f":"IF(COUNTA(H2203:AA2203)=0,\"\",COUNTA(H2203:AA2203))","v":""},null,null,null,null,null,null,null,null,null,null,null,null,null,null,null,null,null,null,null,null,null,null,0,{"$f":"AB2203-AB2202","v":0}]
[null,null,null,null,null,null,null,null,null,null,null,null,null,null,null,null,null,null,null,null,null,null,null,null,null,null,null,0]
[209,null,{"$f":"IF(G2654=\"\",\"\",G2654)","v":"t209"},null,{"$f":"IF(COUNTA(H2205:AA2205)=0,\"\",COUNTA(H2205:AA2205))","v":""},null,null,null,null,null,null,null,null,null,null,null,null,null,null,null,null,null,null,null,null,null,null,0,{"$f":"AB2205-AB2204","v":0}]
[null,null,null,null,null,null,null,null,null,null,null,null,null,null,null,null,null,null,null,null,null,null,null,null,null,null,null,0]
[209,null,null,null,{"$f":"IF(COUNTA(H2207:AA2207)=0,\"\",COUNTA(H2207:AA2207))","v":""},null,null,null,null,null,null,null,null,null,null,null,null,null,null,null,null,null,null,null,null,null,null,0,{"$f":"AB2207-AB2206","v":0}]
[null,null,null,null,null,null,null,null,null,null,null,null,null,null,null,null,null,null,null,null,null,null,null,null,null,null,null,0]
[209,null,null,null,{"$f":"IF(COUNTA(H2209:AA2209)=0,\"\",COUNTA(H2209:AA2209))","v":""},null,null,null,null,null,null,null,null,null,null,null,null,null,null,null,null,null,null,null,null,null,null,0,{"$f":"AB2209-AB2208","v":0}]
[null,null,null,null,null,null,null,null,null,null,null,null,null,null,null,null,null,null,null,null,null,null,null,null,null,null,null,0]
[209,null,null,null,{"$f":"IF(COUNTA(H2211:AA2211)=0,\"\",COUNTA(H2211:AA2211))","v":""},null,null,null,null,null,null,null,null,null,null,null,null,null,null,null,null,null,null,null,null,null,null,0,{"$f":"AB2211-AB2210","v":0}]
[null,null,null,null,null,null,null,null,null,null,null,null,null,null,null,null,null,null,null,null,null,null,null,null,null,null,null,{"$f":"COUNTA(H2212:AA2212)","v":0}]
[209,null,null,null,{"$f":"IF(COUNTA(H2213:AA2213)=0,\"\",COUNTA(H2213:AA2213))","v":""},null,null,null,null,null,null,null,null,null,null,null,null,null,null,null,null,null,null,null,null,null,null,0,{"$f":"AB2213-AB2212","v":0}]
[null,null,null,null,null,null,null,null,null,null,null,null,null,null,null,null,null,null,null,null,null,null,null,null,null,null,null,0]
[210,null,{"$f":"IF(G2656=\"\",\"\",G2656)","v":"t210"},null,{"$f":"IF(COUNTA(H2215:AA2215)=0,\"\",COUNTA(H2215:AA2215))","v":""},null,null,null,null,null,null,null,null,null,null,null,null,null,null,null,null,null,null,null,null,null,null,0,{"$f":"AB2215-AB2214","v":0}]
[null,null,null,null,null,null,null,null,null,null,null,null,null,null,null,null,null,null,null,null,null,null,null,null,null,null,null,0]
[210,null,null,null,{"$f":"IF(COUNTA(H2217:AA2217)=0,\"\",COUNTA(H2217:AA2217))","v":""},null,null,null,null,null,null,null,null,null,null,null,null,null,null,null,null,null,null,null,null,null,null,0,{"$f":"AB2217-AB2216","v":0}]
[null,null,null,null,null,null,null,null,null,null,null,null,null,null,null,null,null,null,null,null,null,null,null,null,null,null,null,0]
[210,null,null,null,{"$f":"IF(COUNTA(H2219:AA2219)=0,\"\",COUNTA(H2219:AA2219))","v":""},null,null,null,null,null,null,null,null,null,null,null,null,null,null,null,null,null,null,null,null,null,null,0,{"$f":"AB2219-AB2218","v":0}]
[null,null,null,null,null,null,null,null,null,null,null,null,null,null,null,null,null,null,null,null,null,null,null,null,null,null,null,0]
[210,null,null,null,{"$f":"IF(COUNTA(H2221:AA2221)=0,\"\",COUNTA(H2221:AA2221))","v":""},null,null,null,null,null,null,null,null,null,null,null,null,null,null,null,null,null,null,null,null,null,null,0,{"$f":"AB2221-AB2220","v":0}]
[null,null,null,null,null,null,null,null,null,null,null,null,null,null,null,null,null,null,null,null,null,null,null,null,null,null,null,0]
[210,null,null,null,{"$f":"IF(COUNTA(H2223:AA2223)=0,\"\",COUNTA(H2223:AA2223))","v":""},null,null,null,null,null,null,null,null,null,null,null,null,null,null,null,null,null,null,null,null,null,null,0,{"$f":"AB2223-AB2222","v":0}]
[null,null,"授業コマ数",null,{"$f":"SUM(E4:E2223)","v":524},null,null,null,null,null,null,null,null,null,null,null,null,null,null,null,null,null,null,null,null,null,"未入力セル合計",null,{"$f":"SUM(AC4:AC2223)","v":38}]
[]
[]
[null,null,null,null,null,null,null,"全職員曜日"]
[null,null,null,null,null,null,null,null,null,null,"  月",null,null,null,null,null,null,null,"　火",null,null,null,null,null,null,null,"　水",null,null,null,null,null,null,null,"  木",null,null,null,null,null,null,null,"  金",null,null,null,null,null,null,"　土"]
[null,null,null,null,null,null,null,1,2,3,4,5,6,7,8,1,2,3,4,5,6,7,8,1,2,3,4,5,6,7,8,1,2,3,4,5,6,7,8,1,2,3,4,5,6,7,8,1,2,3,4,5,6]
[null,null,null,null,null,null,null,1,2,3,4,5,6,7,8,9,10,11,12,13,14,15,16,17,18,19,20,21,22,23,24,25,26,27,28,29,30,31,32,33,34,35,36,37,38,39,40,41,42,43,44,45,46]
[null,null,null,null,null,null,"*.-",null,null,null,null,null,null,"*","*",null,null,null,null,null,null,"*","*",null,null,null,null,null,null,"*","*",null,null,null,null,null,null,"*","*",null,null,null,null,null,"土1,2","*","*",null,null,"必修ク","必修ク","*","*"]
[null,null,null,null,null,null,"ｺﾒﾝﾄ",null,null,null,null,null,null,"*","*",null,null,null,null,null,null,"*","*",null,null,null,null,null,null,"*","*",null,null,null,null,null,null,"*","*",null,null,null,null,null,"-","*","*",null,null,"-","-","*","*"]
[]
[null,"個別職員一週間に入れる場合ここに＊・ーを入力"]
[null,null,null,"↓",null,"個別職員"]
[null,null,null,"*.-",null,null,null,null,null,null,"  月",null,null,null,null,null,null,null,"　火",null,null,null,null,null,null,null,"　水",null,null,null,null,null,null,null,"  木",null,null,null,null,null,null,null,"  金",null,null,null,null,null,null,"　土",null,null,null,"入力"]
[null,null,null,"ｺﾒﾝﾄ","職員NO","教科","担当",1,2,3,4,5,6,7,8,1,2,3,4,5,6,7,8,1,2,3,4,5,6,7,8,1,2,3,4,5,6,7,8,1,2,3,4,5,6,7,8,1,2,3,4,5,6,"コマ数"]
[null,null,null,null,1,null,"小杉",null,"研修","校務",null,null,"研修",null,null,null,null,null,null,null,null,null,null,null,null,"教務",null,null,null,null,null,"学年会",null,null,null,null,null,null,null,null,null,"研修","教科会","教育課",null,null,null,null,null,null,null,null,null,{"$f":"COUNTA(H2238:BA2238)-COUNTIF(H2238:BA2238,\"*-*\")","v":8}]
[null,null,null,null,null,null,"1年主"]
[null,null,null,null,2," ","桜井",null,null,null,null,"進路",null,null,null,null,null,null,null,null,null,null,null,null,null,null,null,null,null,null,null,"学年会",null,null,null,null,null,null,null,null,null,null,"教科会",null,null,null,null,null,null,null,null,null,null,{"$f":"COUNTA(H2240:BA2240)-COUNTIF(H2240:BA2240,\"*-*\")","v":3}]
[null,null,null,null,null,null,"1-6担"]
[null,null,null,null,3,"国","小野島",null,null,null,"教科外",null,null,null,null,null,null,null,null,null,null,null,null,null,null,null,null,null,null,null,null,"学年会",null,null,null,null,null,null,null,null,null,null,"教科会",null,null,null,null,null,null,null,null,null,null,{"$f":"COUNTA(H2242:BA2242)-COUNTIF(H2242:BA2242,\"*-*\")","v":3}]
[null,null,null,null,null,null,"1-3副"]
[null,null,null,null,4,null,"榎本",null,null,null,null,null,null,null,null,null,null,null,"学年会",null,null,null,null,null,null,null,null,null,null,null,null,null,null,null,null,null,null,null,null,null,null,null,"教科会",null,null,null,null,null,null,null,null,null,null,{"$f":"COUNTA(H2244:BA2244)-COUNTIF(H2244:BA2244,\"*-*\")","v":2}]
[null,null,null,null,null,null,"2-5担"]
[null,null,null,null,5,null,"矢島",null,"研修","研修","教科外",null,"研修",null,null,null,null,null,"学年会",null,null,null,null,"研修","研修","研修","研修","研修","研修",null,null,null,null,null,null,"研修",null,null,null,null,null,"研修","教科会",null,null,null,null,null,null,null,null,null,null,{"$f":"COUNTA(H2246:BA2246)-COUNTIF(H2246:BA2246,\"*-*\")","v":14}]
[null,null,null,null,null,null,"2-12副"]
[null,null,null,null,6,null,"関根",null,null,null,null,null,null,null,null,"学年会",null,null,"3-8",null,null,null,null,null,null,null,null,null,null,null,null,null,null,"3-8","生徒指",null,null,null,null,null,null,null,"教科会",null,null,null,null,null,null,null,null,null,null,{"$f":"COUNTA(H2248:BA2248)-COUNTIF(H2248:BA2248,\"*-*\")","v":3}]
[null,null,null,null,null,null,"3-5担",null,null,null,null,null,null,null,null,null,null,null,"表現",null,null,null,null,null,null,null,null,null,null,null,null,null,null,"表現"]
[null,null,null,null,7," ","松本ﾔ",null,null,"研修","教科外",null,null,null,null,"学年会",null,"3-3",null,null,null,null,null,null,null,null,null,null,null,null,null,null,null,null,"3-3","研修",null,null,null,null,null,null,"教科会",null,null,null,null,null,null,null,null,null,null,{"$f":"COUNTA(H2250:BA2250)-COUNTIF(H2250:BA2250,\"*-*\")","v":5}]
[null,null,null,null,null,null,"3-48副",null,null,null,null,null,null,null,null,null,null,"表現",null,null,null,null,null,null,null,null,null,null,null,null,null,null,null,null,"表現"]
[null,null,null,null,8," ","千田",null,null,null,null,null,null,null,null,null,null,"3-1","3-3",null,null,null,null,null,null,null,null,null,null,null,null,"3-1","3-3",null,null,null,null,null,null,null,"3-3","3-1",null,null,null,null,null,null,null,null,null,null,null,{"$f":"COUNTA(H2252:BA2252)-COUNTIF(H2252:BA2252,\"*-*\")","v":0}]
[null,null,null,null,null,null,null,null,null,null,null,null,null,null,null,null,null,"現文","現文",null,null,null,null,null,null,null,null,null,null,null,null,"現文","現文",null,null,null,null,null,null,null,"現文","現文"]
[null,null,null,null,9,null,"山田",null,null,null,null,null,null,null,null,null,null,"3-3","3-8",null,null,null,null,null,null,null,null,null,null,null,null,null,null,"3-8","3-3",null,null,null,null,null,null,null,null,null,null,null,null,null,null,null,null,null,null,{"$f":"COUNTA(H2254:BA2254)-COUNTIF(H2254:BA2254,\"*-*\")","v":0}]
[null,null,null,null,null,null,null,null,null,null,null,null,null,null,null,null,null,"表現","表現",null,null,null,null,null,null,null,null,null,null,null,null,null,null,"表現","表現"]
[null,null,null,null,10,null,"t10",null,null,null,null,null,null,null,null,null,null,null,null,null,null,null,null,null,null,null,null,null,null,null,null,null,null,null,null,null,null,null,null,null,null,null,null,null,null,null,null,null,null,null,null,null,null,{"$f":"COUNTA(H2256:BA2256)-COUNTIF(H2256:BA2256,\"*-*\")","v":0}]
[]
[null,null,null,null,11," ","t11",null,null,null,null,null,null,null,null,null,null,null,null,null,null,null,null,null,null,null,null,null,null,null,null,null,null,null,null,null,null,null,null,null,null,null,null,null,null,null,null,null,null,null,null,null,null,{"$f":"COUNTA(H2258:BA2258)-COUNTIF(H2258:BA2258,\"*-*\")","v":0}]
[]
[null,null,null,null,12,null,"t12",null,null,null,null,null,null,null,null,null,null,null,null,null,null,null,null,null,null,null,null,null,null,null,null,null,null,null,null,null,null,null,null,null,null,null,null,null,null,null,null,null,null,null,null,null,null,{"$f":"COUNTA(H2260:BA2260)-COUNTIF(H2260:BA2260,\"*-*\")","v":0}]
[]
[null,null,null,null,13,null,"t13",null,null,null,null,null,null,null,null,null,null,null,null,null,null,null,null,null,null,null,null,null,null,null,null,null,null,null,null,null,null,null,null,null,null,null,null,null,null,null,null,null,null,null,null,null,null,{"$f":"COUNTA(H2262:BA2262)-COUNTIF(H2262:BA2262,\"*-*\")","v":0}]
[]
[null,null,null,null,14,null,"t14",null,null,null,null,null,null,null,null,null,null,null,null,null,null,null,null,null,null,null,null,null,null,null,null,null,null,null,null,null,null,null,null,null,null,null,null,null,null,null,null,null,null,null,null,null,null,{"$f":"COUNTA(H2264:BA2264)-COUNTIF(H2264:BA2264,\"*-*\")","v":0}]
[]
[null,null,null,null,15,null,"t15",null,null,null,null,null,null,null,null,null,null,null,null,null,null,null,null,null,null,null,null,null,null,null,null,null,null,null,null,null,null,null,null,null,null,null,null,null,null,null,null,null,null,null,null,null,null,{"$f":"COUNTA(H2266:BA2266)-COUNTIF(H2266:BA2266,\"*-*\")","v":0}]
[]
[null,null,null,null,16,null,"t16",null,null,null,null,null,null,null,null,null,null,null,null,null,null,null,null,null,null,null,null,null,null,null,null,null,null,null,null,null,null,null,null,null,null,null,null,null,null,null,null,null,null,null,null,null,null,{"$f":"COUNTA(H2268:BA2268)-COUNTIF(H2268:BA2268,\"*-*\")","v":0}]
[]
[null,null,null,null,17,null,"t17",null,null,null,null,null,null,null,null,null,null,null,null,null,null,null,null,null,null,null,null,null,null,null,null,null,null,null,null,null,null,null,null,null,null,null,null,null,null,null,null,null,null,null,null,null,null,{"$f":"COUNTA(H2270:BA2270)-COUNTIF(H2270:BA2270,\"*-*\")","v":0}]
[]
[null,null,null,null,18,null,"t18",null,null,null,null,null,null,null,null,null,null,null,null,null,null,null,null,null,null,null,null,null,null,null,null,null,null,null,null,null,null,null,null,null,null,null,null,null,null,null,null,null,null,null,null,null,null,{"$f":"COUNTA(H2272:BA2272)-COUNTIF(H2272:BA2272,\"*-*\")","v":0}]
[null,null,null,null,null,"語"]
[null,null,null,null,19,null,"t19",null,null,null,null,null,null,null,null,null,null,null,null,null,null,null,null,null,null,null,null,null,null,null,null,null,null,null,null,null,null,null,null,null,null,null,null,null,null,null,null,null,null,null,null,null,null,{"$f":"COUNTA(H2274:BA2274)-COUNTIF(H2274:BA2274,\"*-*\")","v":0}]
[]
[null,null,null,null,20," ","t20",null,null,null,null,null,null,null,null,null,null,null,null,null,null,null,null,null,null,null,null,null,null,null,null,null,null,null,null,null,null,null,null,null,null,null,null,null,null,null,null,null,null,null,null,null,null,{"$f":"COUNTA(H2276:BA2276)-COUNTIF(H2276:BA2276,\"*-*\")","v":0}]
[]
[null,null,null,null,21," ","新井",null,null,null,null,null,null,null,null,null,null,null,null,"教科会",null,null,null,null,null,null,null,null,null,null,null,"学年会",null,null,null,null,null,null,null,null,null,null,null,null,null,null,null,null,null,null,null,null,null,{"$f":"COUNTA(H2278:BA2278)-COUNTIF(H2278:BA2278,\"*-*\")","v":2}]
[null,null,null,null,null,null,"1-2担"]
[null,null,null,null,22,null,"福田",null,null,null,"教科外",null,null,null,null,null,null,null,null,"教科会",null,null,null,null,null,null,null,null,null,null,null,"学年会",null,null,null,null,null,null,null,null,null,null,null,null,null,null,null,null,null,null,null,null,null,{"$f":"COUNTA(H2280:BA2280)-COUNTIF(H2280:BA2280,\"*-*\")","v":3}]
[null,null,null,null,null,null,"1-5担 "]
[null,null,null,null,23,"地","鶴巻",null,null,null,null,null,null,null,null,null,null,null,null,"教科会",null,null,null,null,null,"教務",null,null,null,null,null,"学年会",null,null,null,null,null,null,null,null,null,null,null,"教育課",null,null,null,null,null,null,null,null,null,{"$f":"COUNTA(H2282:BA2282)-COUNTIF(H2282:BA2282,\"*-*\")","v":4}]
[null,null,null,null,null,null,"1-57副"]
[null,null,null,null,24," ","小栗",null,null,null,null,"進路",null,null,null,null,null,null,"学年会","教科会","研修",null,null,null,null,null,null,null,null,null,null,null,"研修",null,null,null,null,null,null,null,null,null,null,null,null,null,null,null,null,null,null,null,null,{"$f":"COUNTA(H2284:BA2284)-COUNTIF(H2284:BA2284,\"*-*\")","v":5}]
[null,null,null,null,null,null,"2-4担"]
[null,null,null,null,25,null,"程田",null,null,null,null,null,null,null,null,"学年会",null,null,null,"教科会",null,null,null,null,null,"教務",null,null,null,null,null,null,null,null,null,null,null,null,null,null,null,null,null,"教育課",null,null,null,null,null,null,null,null,null,{"$f":"COUNTA(H2286:BA2286)-COUNTIF(H2286:BA2286,\"*-*\")","v":4}]
[null,null,null,null,null,null,"3年主"]
[null,null,null,null,26,null,"長澤",null,"研修",null,null,null,null,null,null,"学年会",null,null,null,"教科会","研修",null,null,"研修","研修","研修","研修","研修","研修",null,null,null,"研修",null,"生徒指",null,null,null,null,null,null,"研修",null,null,null,null,null,null,null,null,null,null,null,{"$f":"COUNTA(H2288:BA2288)-COUNTIF(H2288:BA2288,\"*-*\")","v":13}]
[null,null,null,null,null,null,"3年付"]
[null,null,null,null,27," ","松本ﾀ",null,null,"校務",null,null,null,null,null,null,null,null,null,"*","*",null,null,null,null,null,null,"*","*",null,null,null,null,null,"生徒指",null,null,null,null,null,null,null,null,null,null,null,null,null,null,null,null,null,null,{"$f":"COUNTA(H2290:BA2290)-COUNTIF(H2290:BA2290,\"*-*\")","v":6}]
[null,null,null,null,null,null,"生徒主"]
[null,null,null,null,28,"歴","高橋",null,null,null,null,null,null,null,null,null,null,null,null,null,null,null,null,null,null,null,null,null,null,null,null,null,null,null,null,null,null,null,null,null,null,null,null,null,null,null,null,null,null,null,null,null,null,{"$f":"COUNTA(H2292:BA2292)-COUNTIF(H2292:BA2292,\"*-*\")","v":0}]
[]
[null,null,null,null,29,null,"t29",null,null,null,null,null,null,null,null,null,null,null,null,null,null,null,null,null,null,null,null,null,null,null,null,null,null,null,null,null,null,null,null,null,null,null,null,null,null,null,null,null,null,null,null,null,null,{"$f":"COUNTA(H2294:BA2294)-COUNTIF(H2294:BA2294,\"*-*\")","v":0}]
[]
[null,null,null,null,30,"  ・","t30",null,null,null,null,null,null,null,null,null,null,null,null,null,null,null,null,null,null,null,null,null,null,null,null,null,null,null,null,null,null,null,null,null,null,null,null,null,null,null,null,null,null,null,null,null,null,{"$f":"COUNTA(H2296:BA2296)-COUNTIF(H2296:BA2296,\"*-*\")","v":0}]
[]
[null,null,null,null,31,null,"t31",null,null,null,null,null,null,null,null,null,null,null,null,null,null,null,null,null,null,null,null,null,null,null,null,null,null,null,null,null,null,null,null,null,null,null,null,null,null,null,null,null,null,null,null,null,null,{"$f":"COUNTA(H2298:BA2298)-COUNTIF(H2298:BA2298,\"*-*\")","v":0}]
[]
[null,null,null,null,32,"公","t32",null,null,null,null,null,null,null,null,null,null,null,null,null,null,null,null,null,null,null,null,null,null,null,null,null,null,null,null,null,null,null,null,null,null,null,null,null,null,null,null,null,null,null,null,null,null,{"$f":"COUNTA(H2300:BA2300)-COUNTIF(H2300:BA2300,\"*-*\")","v":0}]
[]
[null,null,null,null,33," ","t33",null,null,null,null,null,null,null,null,null,null,null,null,null,null,null,null,null,null,null,null,null,null,null,null,null,null,null,null,null,null,null,null,null,null,null,null,null,null,null,null,null,null,null,null,null,null,{"$f":"COUNTA(H2302:BA2302)-COUNTIF(H2302:BA2302,\"*-*\")","v":0}]
[]
[null,null,null,null,34,null,"t34",null,null,null,null,null,null,null,null,null,null,null,null,null,null,null,null,null,null,null,null,null,null,null,null,null,null,null,null,null,null,null,null,null,null,null,null,null,null,null,null,null,null,null,null,null,null,{"$f":"COUNTA(H2304:BA2304)-COUNTIF(H2304:BA2304,\"*-*\")","v":0}]
[]
[null,null,null,null,35,null,"t35",null,null,null,null,null,null,null,null,null,null,null,null,null,null,null,null,null,null,null,null,null,null,null,null,null,null,null,null,null,null,null,null,null,null,null,null,null,null,null,null,null,null,null,null,null,null,{"$f":"COUNTA(H2306:BA2306)-COUNTIF(H2306:BA2306,\"*-*\")","v":0}]
[]
[null,null,null,null,36,null,"t36",null,null,null,null,null,null,null,null,null,null,null,null,null,null,null,null,null,null,null,null,null,null,null,null,null,null,null,null,null,null,null,null,null,null,null,null,null,null,null,null,null,null,null,null,null,null,{"$f":"COUNTA(H2308:BA2308)-COUNTIF(H2308:BA2308,\"*-*\")","v":0}]
[]
[null,null,null,null,37,null,"t37",null,null,null,null,null,null,null,null,null,null,null,null,null,null,null,null,null,null,null,null,null,null,null,null,null,null,null,null,null,null,null,null,null,null,null,null,null,null,null,null,null,null,null,null,null,null,{"$f":"COUNTA(H2310:BA2310)-COUNTIF(H2310:BA2310,\"*-*\")","v":0}]
[null,null,null,null,null," "]
[null,null,null,null,38,null,"t38",null,null,null,null,null,null,null,null,null,null,null,null,null,null,null,null,null,null,null,null,null,null,null,null,null,null,null,null,null,null,null,null,null,null,null,null,null,null,null,null,null,null,null,null,null,null,{"$f":"COUNTA(H2312:BA2312)-COUNTIF(H2312:BA2312,\"*-*\")","v":0}]
[null,null,null,null,null,"民"]
[null,null,null,null,39,null,"t39",null,null,null,null,null,null,null,null,null,null,null,null,null,null,null,null,null,null,null,null,null,null,null,null,null,null,null,null,null,null,null,null,null,null,null,null,null,null,null,null,null,null,null,null,null,null,{"$f":"COUNTA(H2314:BA2314)-COUNTIF(H2314:BA2314,\"*-*\")","v":0}]
[]
[null,null,null,null,40,null,"t40",null,null,null,null,null,null,null,null,null,null,null,null,null,null,null,null,null,null,null,null,null,null,null,null,null,null,null,null,null,null,null,null,null,null,null,null,null,null,null,null,null,null,null,null,null,null,{"$f":"COUNTA(H2316:BA2316)-COUNTIF(H2316:BA2316,\"*-*\")","v":0}]
[]
[null,null,null,null,41,null,"金子",null,null,null,null,null,null,null,null,null,null,null,null,"*","*",null,null,null,null,null,null,null,null,null,null,"学年会",null,null,null,null,null,null,null,null,null,"教科会",null,null,null,null,null,null,null,null,null,null,null,{"$f":"COUNTA(H2318:BA2318)-COUNTIF(H2318:BA2318,\"*-*\")","v":4}]
[null,null,null,null,null,null,"1-8担"]
[null,null,null,null,42,null,"山根ﾀ",null,null,null,null,null,null,null,null,null,null,null,null,null,null,null,null,null,null,null,null,null,null,null,null,"学年会",null,null,null,null,null,null,null,null,null,"教科会",null,null,null,null,null,null,null,null,null,null,null,{"$f":"COUNTA(H2320:BA2320)-COUNTIF(H2320:BA2320,\"*-*\")","v":2}]
[null,null,null,null,null,null,"1-2副"]
[null,null,null,null,43,"数","斉藤ﾄ",null,null,null,"教科外",null,null,null,null,null,null,null,"学年会",null,null,null,null,null,null,null,null,null,null,null,null,null,null,null,null,null,null,null,null,null,null,"教科会",null,"教育課",null,null,null,null,null,null,null,null,null,{"$f":"COUNTA(H2322:BA2322)-COUNTIF(H2322:BA2322,\"*-*\")","v":4}]
[null,null,null,null,null,null,"2-3担"]
[null,null,null,null,44," ","市ノ川",null,null,null,null,null,null,null,null,null,null,null,"学年会",null,null,null,null,null,null,null,null,null,null,null,null,null,null,null,"生徒指",null,null,null,null,"*","*","*","*","*","*",null,null,null,null,null,null,null,null,{"$f":"COUNTA(H2324:BA2324)-COUNTIF(H2324:BA2324,\"*-*\")","v":8}]
[null,null,null,null,null,null,"2-8担"]
[null,null,null,null,45,null,"多田",null,"3-4",null,null,null,null,null,null,"学年会",null,null,null,null,null,null,null,null,null,null,null,null,null,null,null,null,null,"3-4",null,null,null,null,null,null,null,"教科会",null,null,null,null,null,null,null,null,null,null,null,{"$f":"COUNTA(H2326:BA2326)-COUNTIF(H2326:BA2326,\"*-*\")","v":2}]
[null,null,null,null,null,null,"3-4担",null,"数Ｃ",null,null,null,null,null,null,null,null,null,null,null,null,null,null,null,null,null,null,null,null,null,null,null,null,"数Ｃ"]
[null,null,null,null,46,null,"菊川",null,"3-4","校務",null,"進路",null,null,null,null,null,null,null,"*","*",null,null,null,null,null,"*","*","*",null,null,null,null,"3-4",null,null,null,null,null,null,null,"教科会",null,null,null,null,null,null,null,null,null,null,null,{"$f":"COUNTA(H2328:BA2328)-COUNTIF(H2328:BA2328,\"*-*\")","v":8}]
[null,null,null,null,null,null,"進路主",null,"数Ｃ",null,null,null,null,null,null,null,null,null,null,null,null,null,null,null,null,null,null,null,null,null,null,null,null,"数Ｃ"]
[null,null,null,null,47," ","t47",null,null,null,null,null,null,null,null,null,null,null,null,null,null,null,null,null,null,null,null,null,null,null,null,null,null,null,null,null,null,null,null,null,null,null,null,null,null,null,null,null,null,null,null,null,null,{"$f":"COUNTA(H2330:BA2330)-COUNTIF(H2330:BA2330,\"*-*\")","v":0}]
[]
[null,null,null,null,48,null,"t48",null,null,null,null,null,null,null,null,null,null,null,null,null,null,null,null,null,null,null,null,null,null,null,null,null,null,null,null,null,null,null,null,null,null,null,null,null,null,null,null,null,null,null,null,null,null,{"$f":"COUNTA(H2332:BA2332)-COUNTIF(H2332:BA2332,\"*-*\")","v":0}]
[]
[null,null,null,null,49," ","t49",null,null,null,null,null,null,null,null,null,null,null,null,null,null,null,null,null,null,null,null,null,null,null,null,null,null,null,null,null,null,null,null,null,null,null,null,null,null,null,null,null,null,null,null,null,null,{"$f":"COUNTA(H2334:BA2334)-COUNTIF(H2334:BA2334,\"*-*\")","v":0}]
[]
[null,null,null,null,50,null,"t50",null,null,null,null,null,null,null,null,null,null,null,null,null,null,null,null,null,null,null,null,null,null,null,null,null,null,null,null,null,null,null,null,null,null,null,null,null,null,null,null,null,null,null,null,null,null,{"$f":"COUNTA(H2336:BA2336)-COUNTIF(H2336:BA2336,\"*-*\")","v":0}]
[]
[null,null,null,null,51,null,"t51",null,null,null,null,null,null,null,null,null,null,null,null,null,null,null,null,null,null,null,null,null,null,null,null,null,null,null,null,null,null,null,null,null,null,null,null,null,null,null,null,null,null,null,null,null,null,{"$f":"COUNTA(H2338:BA2338)-COUNTIF(H2338:BA2338,\"*-*\")","v":0}]
[]
[null,null,null,null,52,null,"t52",null,null,null,null,null,null,null,null,null,null,null,null,null,null,null,null,null,null,null,null,null,null,null,null,null,null,null,null,null,null,null,null,null,null,null,null,null,null,null,null,null,null,null,null,null,null,{"$f":"COUNTA(H2340:BA2340)-COUNTIF(H2340:BA2340,\"*-*\")","v":0}]
[]
[null,null,null,null,53,null,"t53",null,null,null,null,null,null,null,null,null,null,null,null,null,null,null,null,null,null,null,null,null,null,null,null,null,null,null,null,null,null,null,null,null,null,null,null,null,null,null,null,null,null,null,null,null,null,{"$f":"COUNTA(H2342:BA2342)-COUNTIF(H2342:BA2342,\"*-*\")","v":0}]
[]
[null,null,null,null,54,null,"t54",null,null,null,null,null,null,null,null,null,null,null,null,null,null,null,null,null,null,null,null,null,null,null,null,null,null,null,null,null,null,null,null,null,null,null,null,null,null,null,null,null,null,null,null,null,null,{"$f":"COUNTA(H2344:BA2344)-COUNTIF(H2344:BA2344,\"*-*\")","v":0}]
[]
[null,null,null,null,55,null,"t55",null,null,null,null,null,null,null,null,null,null,null,null,null,null,null,null,null,null,null,null,null,null,null,null,null,null,null,null,null,null,null,null,null,null,null,null,null,null,null,null,null,null,null,null,null,null,{"$f":"COUNTA(H2346:BA2346)-COUNTIF(H2346:BA2346,\"*-*\")","v":0}]
[]
[null,null,null,null,56,null,"t56",null,null,null,null,null,null,null,null,null,null,null,null,null,null,null,null,null,null,null,null,null,null,null,null,null,null,null,null,null,null,null,null,null,null,null,null,null,null,null,null,null,null,null,null,null,null,{"$f":"COUNTA(H2348:BA2348)-COUNTIF(H2348:BA2348,\"*-*\")","v":0}]
[]
[null,null,null,null,57,null,"t57",null,null,null,null,null,null,null,null,null,null,null,null,null,null,null,null,null,null,null,null,null,null,null,null,null,null,null,null,null,null,null,null,null,null,null,null,null,null,null,null,null,null,null,null,null,null,{"$f":"COUNTA(H2350:BA2350)-COUNTIF(H2350:BA2350,\"*-*\")","v":0}]
[]
[null,null,null,null,58,null,"t58",null,null,null,null,null,null,null,null,null,null,null,null,null,null,null,null,null,null,null,null,null,null,null,null,null,null,null,null,null,null,null,null,null,null,null,null,null,null,null,null,null,null,null,null,null,null,{"$f":"COUNTA(H2352:BA2352)-COUNTIF(H2352:BA2352,\"*-*\")","v":0}]
[null,null,null,null,null,"学"]
[null,null,null,null,59,null,"t59",null,null,null,null,null,null,null,null,null,null,null,null,null,null,null,null,null,null,null,null,null,null,null,null,null,null,null,null,null,null,null,null,null,null,null,null,null,null,null,null,null,null,null,null,null,null,{"$f":"COUNTA(H2354:BA2354)-COUNTIF(H2354:BA2354,\"*-*\")","v":0}]
[]
[null,null,null,null,60,null,"t60",null,null,null,null,null,null,null,null,null,null,null,null,null,null,null,null,null,null,null,null,null,null,null,null,null,null,null,null,null,null,null,null,null,null,null,null,null,null,null,null,null,null,null,null,null,null,{"$f":"COUNTA(H2356:BA2356)-COUNTIF(H2356:BA2356,\"*-*\")","v":0}]
[]
[null,null,null,null,61,null,"関",null,null,null,null,"進路",null,null,null,null,null,null,null,null,null,null,null,null,null,null,"3-5",null,null,null,null,"学年会",null,null,null,null,null,null,null,null,"教科会",null,null,null,null,null,null,"3-5",null,null,null,null,null,{"$f":"COUNTA(H2358:BA2358)-COUNTIF(H2358:BA2358,\"*-*\")","v":3}]
[null,null,null,null,null,null,"1-1担",null,null,null,null,null,null,null,null,null,null,null,null,null,null,null,null,null,null,null,"物化",null,null,null,null,null,null,null,null,null,null,null,null,null,null,null,null,null,null,null,null,"物化"]
[null,null,null,null,62," ","上村",null,null,"校務",null,"進路",null,null,null,null,null,null,"学年会",null,null,null,null,null,null,null,null,null,null,null,null,null,null,null,null,null,null,null,null,null,"教科会",null,null,null,null,null,null,null,null,null,null,null,null,{"$f":"COUNTA(H2360:BA2360)-COUNTIF(H2360:BA2360,\"*-*\")","v":4}]
[null,null,null,null,null,null,"2-2担"]
[null,null,null,null,63,"理","中田",null,null,null,null,null,null,null,null,null,null,null,"学年会","*","*",null,null,null,null,null,null,null,null,null,null,null,null,null,null,null,null,null,null,null,"教科会",null,null,null,null,null,null,null,null,null,null,null,null,{"$f":"COUNTA(H2362:BA2362)-COUNTIF(H2362:BA2362,\"*-*\")","v":4}]
[null,null,null,null,null,null,"2-6担"]
[null,null,null,null,64,null,"金室",null,null,null,null,null,null,null,null,null,null,null,"学年会",null,null,null,null,null,null,"教務",null,null,null,null,null,null,null,null,null,null,null,null,null,null,"教科会",null,null,"教育課",null,null,null,null,null,null,null,null,null,{"$f":"COUNTA(H2364:BA2364)-COUNTIF(H2364:BA2364,\"*-*\")","v":4}]
[null,null,null,null,null,null,"2-8副"]
[null,null,null,null,65,null,"成谷",null,null,null,null,null,null,null,null,"学年会",null,null,null,null,null,null,null,null,null,null,null,null,null,null,null,null,null,null,null,null,null,null,null,null,"教科会",null,null,null,null,null,null,null,null,null,null,null,null,{"$f":"COUNTA(H2366:BA2366)-COUNTIF(H2366:BA2366,\"*-*\")","v":2}]
[null,null,null,null,null,null,"3-8担"]
[null,null,null,null,66," ","斉藤ｻ",null,null,"校務",null,"進路",null,null,null,"学年会",null,null,null,null,null,null,null,null,null,null,"3-5",null,null,null,null,null,null,null,null,null,null,null,null,null,"教科会",null,null,null,null,null,null,"3-5",null,null,null,null,null,{"$f":"COUNTA(H2368:BA2368)-COUNTIF(H2368:BA2368,\"*-*\")","v":4}]
[null,null,null,null,null,null,"3-25副",null,null,null,null,null,null,null,null,null,null,null,null,null,null,null,null,null,null,null,"物化",null,null,null,null,null,null,null,null,null,null,null,null,null,null,null,null,null,null,null,null,"物化"]
[null,null,null,null,67," ","涌井",null,null,null,null,"進路",null,null,null,"学年会",null,null,null,null,null,null,null,null,null,null,null,null,null,null,null,null,null,null,null,null,null,null,null,null,"教科会",null,null,null,null,null,null,null,null,null,null,null,null,{"$f":"COUNTA(H2370:BA2370)-COUNTIF(H2370:BA2370,\"*-*\")","v":3}]
[null,null,null,null,null,null,"3-3副"]
[null,null,null,null,68,null,"t68",null,null,null,null,null,null,null,null,null,null,null,null,null,null,null,null,null,null,null,null,null,null,null,null,null,null,null,null,null,null,null,null,null,null,null,null,null,null,null,null,null,null,null,null,null,null,{"$f":"COUNTA(H2372:BA2372)-COUNTIF(H2372:BA2372,\"*-*\")","v":0}]
[]
[null,null,null,null,69,null,"t69",null,null,null,null,null,null,null,null,null,null,null,null,null,null,null,null,null,null,null,null,null,null,null,null,null,null,null,null,null,null,null,null,null,null,null,null,null,null,null,null,null,null,null,null,null,null,{"$f":"COUNTA(H2374:BA2374)-COUNTIF(H2374:BA2374,\"*-*\")","v":0}]
[]
[null,null,null,null,70,null,"t70",null,null,null,null,null,null,null,null,null,null,null,null,null,null,null,null,null,null,null,null,null,null,null,null,null,null,null,null,null,null,null,null,null,null,null,null,null,null,null,null,null,null,null,null,null,null,{"$f":"COUNTA(H2376:BA2376)-COUNTIF(H2376:BA2376,\"*-*\")","v":0}]
[]
[null,null,null,null,71," ","t71",null,null,null,null,null,null,null,null,null,null,null,null,null,null,null,null,null,null,null,null,null,null,null,null,null,null,null,null,null,null,null,null,null,null,null,null,null,null,null,null,null,null,null,null,null,null,{"$f":"COUNTA(H2378:BA2378)-COUNTIF(H2378:BA2378,\"*-*\")","v":0}]
[]
[null,null,null,null,72,null,"t72",null,null,null,null,null,null,null,null,null,null,null,null,null,null,null,null,null,null,null,null,null,null,null,null,null,null,null,null,null,null,null,null,null,null,null,null,null,null,null,null,null,null,null,null,null,null,{"$f":"COUNTA(H2380:BA2380)-COUNTIF(H2380:BA2380,\"*-*\")","v":0}]
[]
[null,null,null,null,73,null,"t73",null,null,null,null,null,null,null,null,null,null,null,null,null,null,null,null,null,null,null,null,null,null,null,null,null,null,null,null,null,null,null,null,null,null,null,null,null,null,null,null,null,null,null,null,null,null,{"$f":"COUNTA(H2382:BA2382)-COUNTIF(H2382:BA2382,\"*-*\")","v":0}]
[]
[null,null,null,null,74,null,"t74",null,null,null,null,null,null,null,null,null,null,null,null,null,null,null,null,null,null,null,null,null,null,null,null,null,null,null,null,null,null,null,null,null,null,null,null,null,null,null,null,null,null,null,null,null,null,{"$f":"COUNTA(H2384:BA2384)-COUNTIF(H2384:BA2384,\"*-*\")","v":0}]
[]
[null,null,null,null,75,null,"t75",null,null,null,null,null,null,null,null,null,null,null,null,null,null,null,null,null,null,null,null,null,null,null,null,null,null,null,null,null,null,null,null,null,null,null,null,null,null,null,null,null,null,null,null,null,null,{"$f":"COUNTA(H2386:BA2386)-COUNTIF(H2386:BA2386,\"*-*\")","v":0}]
[]
[null,null,null,null,76,null,"t76",null,null,null,null,null,null,null,null,null,null,null,null,null,null,null,null,null,null,null,null,null,null,null,null,null,null,null,null,null,null,null,null,null,null,null,null,null,null,null,null,null,null,null,null,null,null,{"$f":"COUNTA(H2388:BA2388)-COUNTIF(H2388:BA2388,\"*-*\")","v":0}]
[]
[null,null,null,null,77,null,"t77",null,null,null,null,null,null,null,null,null,null,null,null,null,null,null,null,null,null,null,null,null,null,null,null,null,null,null,null,null,null,null,null,null,null,null,null,null,null,null,null,null,null,null,null,null,null,{"$f":"COUNTA(H2390:BA2390)-COUNTIF(H2390:BA2390,\"*-*\")","v":0}]
[]
[null,null,null,null,78,null,"t78",null,null,null,null,null,null,null,null,null,null,null,null,null,null,null,null,null,null,null,null,null,null,null,null,null,null,null,null,null,null,null,null,null,null,null,null,null,null,null,null,null,null,null,null,null,null,{"$f":"COUNTA(H2392:BA2392)-COUNTIF(H2392:BA2392,\"*-*\")","v":0}]
[null,null,null,null,null,"科"]
[null,null,null,null,79,null,"t79",null,null,null,null,null,null,null,null,null,null,null,null,null,null,null,null,null,null,null,null,null,null,null,null,null,null,null,null,null,null,null,null,null,null,null,null,null,null,null,null,null,null,null,null,null,null,{"$f":"COUNTA(H2394:BA2394)-COUNTIF(H2394:BA2394,\"*-*\")","v":0}]
[]
[null,null,null,null,80,null,"t80",null,null,null,null,null,null,null,null,null,null,null,null,null,null,null,null,null,null,null,null,null,null,null,null,null,null,null,null,null,null,null,null,null,null,null,null,null,null,null,null,null,null,null,null,null,null,{"$f":"COUNTA(H2396:BA2396)-COUNTIF(H2396:BA2396,\"*-*\")","v":0}]
[]
[null,null,null,null,81,null,"名児耶","1-12","1-34","3-24",null,"2-78",null,null,null,null,null,"1-4","1-34","2-78","1-12",null,null,"2-78",null,null,"1-12","3-4","3-4",null,null,"学年会",null,null,null,null,null,null,null,"1-34","3-14",null,"1-5","3-367",null,null,null,null,null,null,null,null,null,{"$f":"COUNTA(H2398:BA2398)-COUNTIF(H2398:BA2398,\"*-*\")","v":1}]
[null,null,null,null,null,null,"1-4担","体育","体育","体育",null,"体育",null,null,null,null,null,"保健","体育","体育","体育",null,null,"体育",null,null,"体育","選体","選体",null,null,"",null,null,null,null,null,null,null,"体育","体育",null,"保健","体育"]
[null,null,null,null,82," ","国延","1-12","1-56",null,"3-14","1-78","",null,null,"1-78",null,null,"1-34","1-6","",null,null,"1-56",null,"1-8","1-12","3-4","3-4",null,null,"学年会","3-14","1-78","生徒指",null,null,null,null,"1-34",null,"1-56",null,"1-7",null,null,null,null,null,null,null,null,null,{"$f":"COUNTA(H2400:BA2400)-COUNTIF(H2400:BA2400,\"*-*\")","v":4}]
[null,null,null,null,null,null,"1年付","体育","体育",null,"体育","体育","",null,null,"体育",null,null,"体育","保健","",null,null,"体育",null,"保健","体育","選体","選体",null,null,"","体育","体育","",null,null,null,null,"体育",null,"体育",null,"保健"]
[null,null,null,null,83,"体","八木","","1-56",null,"教科外",null,"3-367",null,null,"2-2","3-258",null,"学年会",null,"2-12",null,null,"1-56","3-367","2-56",null,"3-4","3-4",null,null,null,null,null,"2-12","2-56",null,null,null,"2-56",null,"2-12","3-258","2-1",null,null,null,null,null,null,null,null,null,{"$f":"COUNTA(H2402:BA2402)-COUNTIF(H2402:BA2402,\"*-*\")","v":3}]
[null,null,null,null,null,null,"2-1担","","体育",null,"","","体育",null,null,"保健","体育",null,"",null,"体育",null,null,"体育","体育","体育",null,"選体","選体",null,null,null,null,null,"体育","体育",null,null,null,"体育",null,"体育","体育","保健"]
[null,null,null,null,84,null,"仙徳","2-34","",null,"3-14","2-78","3-367",null,null,null,"3-258","2-34","学年会","2-78","",null,null,"2-78","3-367",null,"2-7","3-4","3-4",null,null,"2-34","3-14",null,"生徒指",null,null,null,null,null,"2-8",null,"3-258","教育課",null,null,null,null,null,null,null,null,null,{"$f":"COUNTA(H2404:BA2404)-COUNTIF(H2404:BA2404,\"*-*\")","v":5}]
[null,null,null,null,null,null,"2-7担","体育","",null,"体育","体育","体育",null,null,null,"体育","体育","","体育","",null,null,"体育","体育",null,"保健","選体","選体",null,null,"体育","体育",null,"",null,null,null,null,null,"保健",null,"体育",""]
[null,null,null,null,85,null,"大徳","2-34","1-34","3-24","","2-5","",null,null,"1-78","","2-34","学年会",null,"1-12",null,null,null,"2-6","2-56",null,"3-4","3-4",null,null,"2-34",null,null,"生徒指","2-56",null,null,null,"2-56","3-14","1-56",null,"3-367",null,null,null,null,null,null,null,null,null,{"$f":"COUNTA(H2406:BA2406)-COUNTIF(H2406:BA2406,\"*-*\")","v":5}]
[null,null,null,null,null,null,"2-6副","体育","体育","体育",null,"保健","",null,null,"体育","","体育","",null,"体育",null,null,null,"保健","体育",null,"選体","選体",null,null,"体育",null,null,"","体育",null,null,null,"体育","体育","体育",null,"体育"]
[null,null,null,null,86," ","山崎",null,null,"3-24","3-14","1-78","3-367",null,null,"学年会","3-258",null,null,"1-1","",null,null,null,"3-367",null,null,"3-4","3-4",null,null,"1-2","3-14","1-78",null,"1-3",null,null,null,null,"3-14",null,"3-258","3-367",null,null,null,null,null,null,null,null,null,{"$f":"COUNTA(H2408:BA2408)-COUNTIF(H2408:BA2408,\"*-*\")","v":2}]
[null,null,null,null,null,null,"3-2担",null,null,"体育","体育","体育","体育",null,null,"","体育",null,null,"保健","",null,null,null,"体育",null,null,"選体","選体",null,null,"保健","体育","体育",null,"保健",null,null,null,null,"体育",null,"体育","体育"]
[null,null,null,null,87,null,"井上",null,null,"3-24","3-14","","3-367",null,null,"学年会","3-258",null,"2-４",null,"2-12",null,null,null,"3-367",null,"2-3","3-4","3-4",null,null,null,"3-14",null,"2-12",null,null,null,null,null,"3-14","2-12","3-258","3-367",null,null,null,null,null,null,null,null,null,{"$f":"COUNTA(H2410:BA2410)-COUNTIF(H2410:BA2410,\"*-*\")","v":2}]
[null,null,null,null,null,null,"3-7担",null,null,"体育","体育","","体育",null,null,"","体育",null,"保健",null,"体育",null,null,null,"体育",null,"保健","選体","選体",null,null,null,"体育",null,"体育",null,null,null,null,null,"体育","体育","体育","体育"]
[null,null,null,null,88,null,"t88",null,null,null,null,null,null,null,null,null,null,null,null,null,null,null,null,null,null,null,null,null,null,null,null,null,null,null,null,null,null,null,null,null,null,null,null,null,null,null,null,null,null,null,null,null,null,{"$f":"COUNTA(H2412:BA2412)-COUNTIF(H2412:BA2412,\"*-*\")","v":0}]
[]
[null,null,null,null,89,null,"t89",null,null,null,null,null,null,null,null,null,null,null,null,null,null,null,null,null,null,null,null,null,null,null,null,null,null,null,null,null,null,null,null,null,null,null,null,null,null,null,null,null,null,null,null,null,null,{"$f":"COUNTA(H2414:BA2414)-COUNTIF(H2414:BA2414,\"*-*\")","v":0}]
[]
[null,null,null,null,90,null,"t90",null,null,null,null,null,null,null,null,null,null,null,null,null,null,null,null,null,null,null,null,null,null,null,null,null,null,null,null,null,null,null,null,null,null,null,null,null,null,null,null,null,null,null,null,null,null,{"$f":"COUNTA(H2416:BA2416)-COUNTIF(H2416:BA2416,\"*-*\")","v":0}]
[]
[null,null,null,null,91,null,"t91",null,null,null,null,null,null,null,null,null,null,null,null,null,null,null,null,null,null,null,null,null,null,null,null,null,null,null,null,null,null,null,null,null,null,null,null,null,null,null,null,null,null,null,null,null,null,{"$f":"COUNTA(H2418:BA2418)-COUNTIF(H2418:BA2418,\"*-*\")","v":0}]
[]
[null,null,null,null,92,null,"t92",null,null,null,null,null,null,null,null,null,null,null,null,null,null,null,null,null,null,null,null,null,null,null,null,null,null,null,null,null,null,null,null,null,null,null,null,null,null,null,null,null,null,null,null,null,null,{"$f":"COUNTA(H2420:BA2420)-COUNTIF(H2420:BA2420,\"*-*\")","v":0}]
[]
[null,null,null,null,93,null,"t93",null,null,null,null,null,null,null,null,null,null,null,null,null,null,null,null,null,null,null,null,null,null,null,null,null,null,null,null,null,null,null,null,null,null,null,null,null,null,null,null,null,null,null,null,null,null,{"$f":"COUNTA(H2422:BA2422)-COUNTIF(H2422:BA2422,\"*-*\")","v":0}]
[]
[null,null,null,null,94,null,"t94",null,null,null,null,null,null,null,null,null,null,null,null,null,null,null,null,null,null,null,null,null,null,null,null,null,null,null,null,null,null,null,null,null,null,null,null,null,null,null,null,null,null,null,null,null,null,{"$f":"COUNTA(H2424:BA2424)-COUNTIF(H2424:BA2424,\"*-*\")","v":0}]
[]
[null,null,null,null,95,null,"t95",null,null,null,null,null,null,null,null,null,null,null,null,null,null,null,null,null,null,null,null,null,null,null,null,null,null,null,null,null,null,null,null,null,null,null,null,null,null,null,null,null,null,null,null,null,null,{"$f":"COUNTA(H2426:BA2426)-COUNTIF(H2426:BA2426,\"*-*\")","v":0}]
[]
[null,null,null,null,96,null,"t96",null,null,null,null,null,null,null,null,null,null,null,null,null,null,null,null,null,null,null,null,null,null,null,null,null,null,null,null,null,null,null,null,null,null,null,null,null,null,null,null,null,null,null,null,null,null,{"$f":"COUNTA(H2428:BA2428)-COUNTIF(H2428:BA2428,\"*-*\")","v":0}]
[]
[null,null,null,null,97,null,"t97",null,null,null,null,null,null,null,null,null,null,null,null,null,null,null,null,null,null,null,null,null,null,null,null,null,null,null,null,null,null,null,null,null,null,null,null,null,null,null,null,null,null,null,null,null,null,{"$f":"COUNTA(H2430:BA2430)-COUNTIF(H2430:BA2430,\"*-*\")","v":0}]
[null,null,null,null,null," 育"]
[null,null,null,null,98,null,"t98",null,null,null,null,null,null,null,null,null,null,null,null,null,null,null,null,null,null,null,null,null,null,null,null,null,null,null,null,null,null,null,null,null,null,null,null,null,null,null,null,null,null,null,null,null,null,{"$f":"COUNTA(H2432:BA2432)-COUNTIF(H2432:BA2432,\"*-*\")","v":0}]
[]
[null,null,null,null,99,null,"t99",null,null,null,null,null,null,null,null,null,null,null,null,null,null,null,null,null,null,null,null,null,null,null,null,null,null,null,null,null,null,null,null,null,null,null,null,null,null,null,null,null,null,null,null,null,null,{"$f":"COUNTA(H2434:BA2434)-COUNTIF(H2434:BA2434,\"*-*\")","v":0}]
[]
[null,null,null,null,100," ","t100",null,null,null,null,null,null,null,null,null,null,null,null,null,null,null,null,null,null,null,null,null,null,null,null,null,null,null,null,null,null,null,null,null,null,null,null,null,null,null,null,null,null,null,null,null,null,{"$f":"COUNTA(H2436:BA2436)-COUNTIF(H2436:BA2436,\"*-*\")","v":0}]
[]
[null,null,null,null,101," ","杉山","3-168","3-168","2-123","2-123",null,null,null,null,"1-5","1-5",null,null,"3-357","3-357",null,null,"3-24","3-24","教務",null,"1-2","1-2",null,null,"学年会",null,null,null,null,null,null,null,"3-7","3-7","1-7","1-7","教育課",null,null,null,null,null,null,null,null,null,{"$f":"COUNTA(H2438:BA2438)-COUNTIF(H2438:BA2438,\"*-*\")","v":3}]
[null,null,null,null,null,null,"1-7担","芸術","芸術","芸術","芸術",null,null,null,null,"美術","美術",null,null,"芸術","芸術",null,null,"芸術","芸術","",null,"美術","美術",null,null,"",null,null,null,null,null,null,null,"選芸","選芸","美術","美術",""]
[null,null,null,null,102,null,"高橋","3-168","3-168","2-123","2-123","進路",null,null,null,null,null,null,"学年会","3-357","3-357",null,null,"3-24","3-24",null,null,"1-3","1-3",null,null,null,null,"2-456","2-456",null,null,null,null,"3-7","3-7","1-8","1-8",null,null,null,null,null,null,null,null,null,null,{"$f":"COUNTA(H2440:BA2440)-COUNTIF(H2440:BA2440,\"*-*\")","v":2}]
[null,null,null,null,null,null,"2-34副","芸術","芸術","芸術","芸術","",null,null,null,null,null,null,"","芸術","芸術",null,null,"芸術","芸術",null,null,"書道","書道",null,null,null,null,"芸術","芸術",null,null,null,null,"選芸","選芸","書道","書道"]
[null,null,null,null,103,"芸","後藤","3-168","3-168","2-123","2-123",null,null,null,null,"学年会",null,null,null,"3-357","3-357",null,null,"3-24","3-24",null,null,null,null,null,null,"2-78","2-78","2-456","2-456",null,null,null,null,"3-7","3-7","1-1","1-1",null,null,null,null,null,null,null,null,null,null,{"$f":"COUNTA(H2442:BA2442)-COUNTIF(H2442:BA2442,\"*-*\")","v":1}]
[null,null,null,null,null,null,"3-6副","芸術","芸術","芸術","芸術",null,null,null,null,"",null,null,null,"芸術","芸術",null,null,"芸術","芸術",null,null,null,null,null,null,"音美","音美","芸術","芸術",null,null,null,null,"選芸","選芸","音楽","音楽"]
[null,null,null,null,104," ","上原",null,null,null,null,"1-4","1-4",null,null,"1-6","1-6",null,null,null,null,null,null,null,null,null,null,null,null,null,null,null,null,null,null,null,null,null,null,null,null,null,null,null,null,null,null,null,null,null,null,null,null,{"$f":"COUNTA(H2444:BA2444)-COUNTIF(H2444:BA2444,\"*-*\")","v":0}]
[null,null,null,null,null,null,null,null,null,null,null,"音楽","音楽",null,null,"音楽","音楽"]
[null,null,null,null,105,null,"秦",null,null,null,null,null,null,null,null,null,null,null,null,null,null,null,null,null,null,null,null,null,null,null,null,"2-78","2-78","2-456","2-456",null,null,null,null,null,null,null,null,null,null,null,null,null,null,null,null,null,null,{"$f":"COUNTA(H2446:BA2446)-COUNTIF(H2446:BA2446,\"*-*\")","v":0}]
[null,null,null,null,null,null,null,null,null,null,null,null,null,null,null,null,null,null,null,null,null,null,null,null,null,null,null,null,null,null,null,"音美","音美","芸術","芸術"]
[null,null,null,null,106,null,"t106",null,null,null,null,null,null,null,null,null,null,null,null,null,null,null,null,null,null,null,null,null,null,null,null,null,null,null,null,null,null,null,null,null,null,null,null,null,null,null,null,null,null,null,null,null,null,{"$f":"COUNTA(H2448:BA2448)-COUNTIF(H2448:BA2448,\"*-*\")","v":0}]
[]
[null,null,null,null,107,null,"t107",null,null,null,null,null,null,null,null,null,null,null,null,null,null,null,null,null,null,null,null,null,null,null,null,null,null,null,null,null,null,null,null,null,null,null,null,null,null,null,null,null,null,null,null,null,null,{"$f":"COUNTA(H2450:BA2450)-COUNTIF(H2450:BA2450,\"*-*\")","v":0}]
[]
[null,null,null,null,108,null,"t108",null,null,null,null,null,null,null,null,null,null,null,null,null,null,null,null,null,null,null,null,null,null,null,null,null,null,null,null,null,null,null,null,null,null,null,null,null,null,null,null,null,null,null,null,null,null,{"$f":"COUNTA(H2452:BA2452)-COUNTIF(H2452:BA2452,\"*-*\")","v":0}]
[]
[null,null,null,null,109,null,"t109",null,null,null,null,null,null,null,null,null,null,null,null,null,null,null,null,null,null,null,null,null,null,null,null,null,null,null,null,null,null,null,null,null,null,null,null,null,null,null,null,null,null,null,null,null,null,{"$f":"COUNTA(H2454:BA2454)-COUNTIF(H2454:BA2454,\"*-*\")","v":0}]
[]
[null,null,null,null,110,null,"t110",null,null,null,null,null,null,null,null,null,null,null,null,null,null,null,null,null,null,null,null,null,null,null,null,null,null,null,null,null,null,null,null,null,null,null,null,null,null,null,null,null,null,null,null,null,null,{"$f":"COUNTA(H2456:BA2456)-COUNTIF(H2456:BA2456,\"*-*\")","v":0}]
[]
[null,null,null,null,111,null,"t111",null,null,null,null,null,null,null,null,null,null,null,null,null,null,null,null,null,null,null,null,null,null,null,null,null,null,null,null,null,null,null,null,null,null,null,null,null,null,null,null,null,null,null,null,null,null,{"$f":"COUNTA(H2458:BA2458)-COUNTIF(H2458:BA2458,\"*-*\")","v":0}]
[]
[null,null,null,null,112,null,"t112",null,null,null,null,null,null,null,null,null,null,null,null,null,null,null,null,null,null,null,null,null,null,null,null,null,null,null,null,null,null,null,null,null,null,null,null,null,null,null,null,null,null,null,null,null,null,{"$f":"COUNTA(H2460:BA2460)-COUNTIF(H2460:BA2460,\"*-*\")","v":0}]
[]
[null,null,null,null,113,null,"t113",null,null,null,null,null,null,null,null,null,null,null,null,null,null,null,null,null,null,null,null,null,null,null,null,null,null,null,null,null,null,null,null,null,null,null,null,null,null,null,null,null,null,null,null,null,null,{"$f":"COUNTA(H2462:BA2462)-COUNTIF(H2462:BA2462,\"*-*\")","v":0}]
[]
[null,null,null,null,114,null,"t114",null,null,null,null,null,null,null,null,null,null,null,null,null,null,null,null,null,null,null,null,null,null,null,null,null,null,null,null,null,null,null,null,null,null,null,null,null,null,null,null,null,null,null,null,null,null,{"$f":"COUNTA(H2464:BA2464)-COUNTIF(H2464:BA2464,\"*-*\")","v":0}]
[]
[null,null,null,null,115,null,"t115",null,null,null,null,null,null,null,null,null,null,null,null,null,null,null,null,null,null,null,null,null,null,null,null,null,null,null,null,null,null,null,null,null,null,null,null,null,null,null,null,null,null,null,null,null,null,{"$f":"COUNTA(H2466:BA2466)-COUNTIF(H2466:BA2466,\"*-*\")","v":0}]
[]
[null,null,null,null,116,null,"t116",null,null,null,null,null,null,null,null,null,null,null,null,null,null,null,null,null,null,null,null,null,null,null,null,null,null,null,null,null,null,null,null,null,null,null,null,null,null,null,null,null,null,null,null,null,null,{"$f":"COUNTA(H2468:BA2468)-COUNTIF(H2468:BA2468,\"*-*\")","v":0}]
[]
[null,null,null,null,117,null,"t117",null,null,null,null,null,null,null,null,null,null,null,null,null,null,null,null,null,null,null,null,null,null,null,null,null,null,null,null,null,null,null,null,null,null,null,null,null,null,null,null,null,null,null,null,null,null,{"$f":"COUNTA(H2470:BA2470)-COUNTIF(H2470:BA2470,\"*-*\")","v":0}]
[]
[null,null,null,null,118,null,"t118",null,null,null,null,null,null,null,null,null,null,null,null,null,null,null,null,null,null,null,null,null,null,null,null,null,null,null,null,null,null,null,null,null,null,null,null,null,null,null,null,null,null,null,null,null,null,{"$f":"COUNTA(H2472:BA2472)-COUNTIF(H2472:BA2472,\"*-*\")","v":0}]
[null,null,null,null,null,"術"]
[null,null,null,null,119,null,"t119",null,null,null,null,null,null,null,null,null,null,null,null,null,null,null,null,null,null,null,null,null,null,null,null,null,null,null,null,null,null,null,null,null,null,null,null,null,null,null,null,null,null,null,null,null,null,{"$f":"COUNTA(H2474:BA2474)-COUNTIF(H2474:BA2474,\"*-*\")","v":0}]
[]
[null,null,null,null,120," ","t120",null,null,null,null,null,null,null,null,null,null,null,null,null,null,null,null,null,null,null,null,null,null,null,null,null,null,null,null,null,null,null,null,null,null,null,null,null,null,null,null,null,null,null,null,null,null,{"$f":"COUNTA(H2476:BA2476)-COUNTIF(H2476:BA2476,\"*-*\")","v":0}]
[]
[null,null,null,null,121," ","木島",null,null,null,null,null,null,null,null,null,null,null,null,null,null,null,null,null,null,null,null,null,null,null,null,"学年会",null,"教科会","生徒指",null,null,null,null,null,null,null,null,null,null,null,null,null,null,null,null,null,null,{"$f":"COUNTA(H2478:BA2478)-COUNTIF(H2478:BA2478,\"*-*\")","v":3}]
[null,null,null,null,null,null,"1-3担"]
[null,null,null,null,122,null,"安藤",null,null,null,null,null,null,null,null,null,null,null,null,null,null,null,null,null,null,"教務",null,null,null,null,null,"学年会",null,"教科会",null,null,null,null,null,null,null,null,null,"教育課",null,null,null,null,null,null,null,null,null,{"$f":"COUNTA(H2480:BA2480)-COUNTIF(H2480:BA2480,\"*-*\")","v":4}]
[null,null,null,null,null,null,"1-56副"]
[null,null,null,null,123,"英","小井川",null,"2-56","校務",null,null,"2-12",null,null,null,null,"2-56","学年会","2-12",null,null,null,"2-12",null,null,null,null,"2-56",null,null,null,null,"教科会",null,null,null,null,null,null,null,null,"2-12",null,null,null,null,null,"2-56",null,null,null,null,{"$f":"COUNTA(H2482:BA2482)-COUNTIF(H2482:BA2482,\"*-*\")","v":3}]
[null,null,null,null,null,null,"2年主",null,"英Ⅱ",null,null,null,"英Ⅱ",null,null,null,null,"英Ⅱ",null,"英Ⅱ",null,null,null,"英Ⅱ",null,null,null,null,"英Ⅱ",null,null,null,null,null,null,null,null,null,null,null,null,null,"英Ⅱ",null,null,null,null,null,"英Ⅱ"]
[null,null,null,null,124," ","清水ﾀ",null,"2-56",null,null,null,"2-12",null,null,null,null,"2-56","学年会","2-12",null,null,null,"2-12",null,"教務",null,null,"2-56",null,null,null,null,"教科会",null,null,null,null,null,null,null,null,"2-12",null,null,null,null,null,"2-56",null,null,null,null,{"$f":"COUNTA(H2484:BA2484)-COUNTIF(H2484:BA2484,\"*-*\")","v":3}]
[null,null,null,null,null,null,"2-57副",null,"英Ⅱ",null,null,null,"英Ⅱ",null,null,null,null,"英Ⅱ",null,"英Ⅱ",null,null,null,"英Ⅱ",null,null,null,null,"英Ⅱ",null,null,null,null,null,null,null,null,null,null,null,null,null,"英Ⅱ",null,null,null,null,null,"英Ⅱ"]
[null,null,null,null,125," ","清水ﾖ",null,"2-34",null,null,null,"2-12",null,null,null,null,null,"学年会","2-12","2-34",null,null,"2-12",null,"2-34",null,null,null,null,null,null,null,"教科会","生徒指",null,null,null,null,null,"2-34",null,"2-12",null,null,null,null,null,null,null,null,null,null,{"$f":"COUNTA(H2486:BA2486)-COUNTIF(H2486:BA2486,\"*-*\")","v":3}]
[null,null,null,null,null,null,"2年付",null,"英Ⅱ",null,null,null,"英Ⅱ",null,null,null,null,null,null,"英Ⅱ","英Ⅱ",null,null,"英Ⅱ",null,"英Ⅱ",null,null,null,null,null,null,null,null,null,null,null,null,null,null,"英Ⅱ",null,"英Ⅱ"]
[null,null,null,null,126,null,"加藤",null,"2-34",null,"2-78","進路",null,null,null,"学年会",null,null,"2-78",null,"2-34",null,null,null,"2-78","2-34",null,null,null,null,null,null,null,"教科会",null,null,null,null,null,null,"2-34",null,null,"2-78",null,null,null,null,null,null,null,null,null,{"$f":"COUNTA(H2488:BA2488)-COUNTIF(H2488:BA2488,\"*-*\")","v":3}]
[null,null,null,null,null,null,"3-3担",null,"英Ⅱ",null,"英Ⅱ",null,null,null,null,null,null,null,"英Ⅱ",null,"英Ⅱ",null,null,null,"英Ⅱ","英Ⅱ",null,null,null,null,null,null,null,null,null,null,null,null,null,null,"英Ⅱ",null,null,"英Ⅱ"]
[null,null,null,null,127," ","松田",null,"2-34",null,"2-78",null,null,null,null,"学年会",null,null,"2-78",null,"2-34",null,null,null,"2-78","2-34",null,null,null,null,null,null,null,"教科会",null,null,null,null,null,null,"2-34",null,null,"2-78",null,null,null,null,null,null,null,null,null,{"$f":"COUNTA(H2490:BA2490)-COUNTIF(H2490:BA2490,\"*-*\")","v":2}]
[null,null,null,null,null,null,"3-6担",null,"英Ⅱ",null,"英Ⅱ",null,null,null,null,null,null,null,"英Ⅱ",null,"英Ⅱ",null,null,null,"英Ⅱ","英Ⅱ",null,null,null,null,null,null,null,null,null,null,null,null,null,null,"英Ⅱ",null,null,"英Ⅱ"]
[null,null,null,null,128," ","小林",null,"",null,null,null,null,null,null,"学年会",null,null,null,null,null,null,null,null,null,null,null,null,null,null,null,null,null,"教科会",null,null,null,null,null,null,null,null,null,null,null,null,null,null,null,null,null,null,null,{"$f":"COUNTA(H2492:BA2492)-COUNTIF(H2492:BA2492,\"*-*\")","v":3}]
[null,null,null,null,null,null,"3-7副",null,""]
[null,null,null,null,129,null,"舘",null,"2-56","校務","2-78",null,null,null,null,null,null,"2-56","2-78",null,null,null,null,null,"2-78","教務",null,null,"2-56",null,null,null,null,"教科会",null,null,null,null,null,null,null,null,null,"2-78",null,null,null,null,"2-56",null,null,null,null,{"$f":"COUNTA(H2494:BA2494)-COUNTIF(H2494:BA2494,\"*-*\")","v":3}]
[null,null,null,null,null,null,"教務主",null,"英Ⅱ",null,"英Ⅱ",null,null,null,null,null,null,"英Ⅱ","英Ⅱ",null,null,null,null,null,"英Ⅱ",null,null,null,"英Ⅱ",null,null,null,null,null,null,null,null,null,null,null,null,null,null,"英Ⅱ",null,null,null,null,"英Ⅱ"]
[null,null,null,null,130,null,"t130",null,null,null,null,null,null,null,null,null,null,null,null,null,null,null,null,null,null,null,null,null,null,null,null,null,null,null,null,null,null,null,null,null,null,null,null,null,null,null,null,null,null,null,null,null,null,{"$f":"COUNTA(H2496:BA2496)-COUNTIF(H2496:BA2496,\"*-*\")","v":0}]
[]
[null,null,null,null,131," ","t131",null,null,null,null,null,null,null,null,null,null,null,null,null,null,null,null,null,null,null,null,null,null,null,null,null,null,null,null,null,null,null,null,null,null,null,null,null,null,null,null,null,null,null,null,null,null,{"$f":"COUNTA(H2498:BA2498)-COUNTIF(H2498:BA2498,\"*-*\")","v":0}]
[]
[null,null,null,null,132,null,"t132",null,null,null,null,null,null,null,null,null,null,null,null,null,null,null,null,null,null,null,null,null,null,null,null,null,null,null,null,null,null,null,null,null,null,null,null,null,null,null,null,null,null,null,null,null,null,{"$f":"COUNTA(H2500:BA2500)-COUNTIF(H2500:BA2500,\"*-*\")","v":0}]
[]
[null,null,null,null,133,null,"t133",null,null,null,null,null,null,null,null,null,null,null,null,null,null,null,null,null,null,null,null,null,null,null,null,null,null,null,null,null,null,null,null,null,null,null,null,null,null,null,null,null,null,null,null,null,null,{"$f":"COUNTA(H2502:BA2502)-COUNTIF(H2502:BA2502,\"*-*\")","v":0}]
[]
[null,null,null,null,134,null,"t134",null,null,null,null,null,null,null,null,null,null,null,null,null,null,null,null,null,null,null,null,null,null,null,null,null,null,null,null,null,null,null,null,null,null,null,null,null,null,null,null,null,null,null,null,null,null,{"$f":"COUNTA(H2504:BA2504)-COUNTIF(H2504:BA2504,\"*-*\")","v":0}]
[]
[null,null,null,null,135,null,"t135",null,null,null,null,null,null,null,null,null,null,null,null,null,null,null,null,null,null,null,null,null,null,null,null,null,null,null,null,null,null,null,null,null,null,null,null,null,null,null,null,null,null,null,null,null,null,{"$f":"COUNTA(H2506:BA2506)-COUNTIF(H2506:BA2506,\"*-*\")","v":0}]
[]
[null,null,null,null,136,null,"t136",null,null,null,null,null,null,null,null,null,null,null,null,null,null,null,null,null,null,null,null,null,null,null,null,null,null,null,null,null,null,null,null,null,null,null,null,null,null,null,null,null,null,null,null,null,null,{"$f":"COUNTA(H2508:BA2508)-COUNTIF(H2508:BA2508,\"*-*\")","v":0}]
[]
[null,null,null,null,137,null,"t137",null,null,null,null,null,null,null,null,null,null,null,null,null,null,null,null,null,null,null,null,null,null,null,null,null,null,null,null,null,null,null,null,null,null,null,null,null,null,null,null,null,null,null,null,null,null,{"$f":"COUNTA(H2510:BA2510)-COUNTIF(H2510:BA2510,\"*-*\")","v":0}]
[]
[null,null,null,null,138,null,"t138",null,null,null,null,null,null,null,null,null,null,null,null,null,null,null,null,null,null,null,null,null,null,null,null,null,null,null,null,null,null,null,null,null,null,null,null,null,null,null,null,null,null,null,null,null,null,{"$f":"COUNTA(H2512:BA2512)-COUNTIF(H2512:BA2512,\"*-*\")","v":0}]
[null,null,null,null,null,"語"]
[null,null,null,null,139,null,"t139",null,null,null,null,null,null,null,null,null,null,null,null,null,null,null,null,null,null,null,null,null,null,null,null,null,null,null,null,null,null,null,null,null,null,null,null,null,null,null,null,null,null,null,null,null,null,{"$f":"COUNTA(H2514:BA2514)-COUNTIF(H2514:BA2514,\"*-*\")","v":0}]
[]
[null,null,null,null,140,null,"t140",null,null,null,null,null,null,null,null,null,null,null,null,null,null,null,null,null,null,null,null,null,null,null,null,null,null,null,null,null,null,null,null,null,null,null,null,null,null,null,null,null,null,null,null,null,null,{"$f":"COUNTA(H2516:BA2516)-COUNTIF(H2516:BA2516,\"*-*\")","v":0}]
[]
[null,null,null,null,141,null,"村山",null,null,"2-4","2-4","1-3","1-3",null,null,"1-2","1-2","2-2","2-2",null,null,null,null,"2-3","2-3","2-1","2-1",null,null,null,null,"学年会",null,"1-1","1-1",null,null,null,null,null,null,"1-4","1-4","教育課",null,null,null,null,null,null,null,null,null,{"$f":"COUNTA(H2518:BA2518)-COUNTIF(H2518:BA2518,\"*-*\")","v":2}]
[null,null,null,null,null,null,"1-1副",null,null,"家庭","家庭","家庭","家庭",null,null,"家庭","家庭","家庭","家庭",null,null,null,null,"家庭","家庭","家庭","家庭",null,null,null,null,"",null,"家庭","家庭",null,null,null,null,null,null,"家庭","家庭",""]
[null,null,null,null,142,"家","川崎",null,null,"1-5","1-5","進路",null,null,null,"学年会",null,"1-8","1-8","1-7","1-7",null,null,null,null,"3-2","3-2","2-8","2-8",null,null,"1-6","1-6",null,null,null,null,null,null,"2-7","2-7","2-6","2-6",null,null,null,null,null,null,null,null,null,null,{"$f":"COUNTA(H2520:BA2520)-COUNTIF(H2520:BA2520,\"*-*\")","v":2}]
[null,null,null,null,null,null,"3-1担",null,null,"家庭","家庭","",null,null,null,"",null,"家庭","家庭","家庭","家庭",null,null,null,null,"食物","食物","家庭","家庭",null,null,"家庭","家庭",null,null,null,null,null,null,"家庭","家庭","家庭","家庭"]
[null,null,null,null,143,null,"寺西",null,null,null,null,null,null,null,null,"2-5","2-5",null,null,null,null,null,null,null,null,null,null,null,null,null,null,null,null,null,null,null,null,null,null,null,null,null,null,null,null,null,null,null,null,null,null,null,null,{"$f":"COUNTA(H2522:BA2522)-COUNTIF(H2522:BA2522,\"*-*\")","v":0}]
[null,null,null,null,null,null,null,null,null,null,null,null,null,null,null,"家庭","家庭"]
[null,null,null,null,144,null,"t144",null,null,null,null,null,null,null,null,null,null,null,null,null,null,null,null,null,null,null,null,null,null,null,null,null,null,null,null,null,null,null,null,null,null,null,null,null,null,null,null,null,null,null,null,null,null,{"$f":"COUNTA(H2524:BA2524)-COUNTIF(H2524:BA2524,\"*-*\")","v":0}]
[]
[null,null,null,null,145,null,"t145",null,null,null,null,null,null,null,null,null,null,null,null,null,null,null,null,null,null,null,null,null,null,null,null,null,null,null,null,null,null,null,null,null,null,null,null,null,null,null,null,null,null,null,null,null,null,{"$f":"COUNTA(H2526:BA2526)-COUNTIF(H2526:BA2526,\"*-*\")","v":0}]
[]
[null,null,null,null,146,null,"t146",null,null,null,null,null,null,null,null,null,null,null,null,null,null,null,null,null,null,null,null,null,null,null,null,null,null,null,null,null,null,null,null,null,null,null,null,null,null,null,null,null,null,null,null,null,null,{"$f":"COUNTA(H2528:BA2528)-COUNTIF(H2528:BA2528,\"*-*\")","v":0}]
[]
[null,null,null,null,147,null,"t147",null,null,null,null,null,null,null,null,null,null,null,null,null,null,null,null,null,null,null,null,null,null,null,null,null,null,null,null,null,null,null,null,null,null,null,null,null,null,null,null,null,null,null,null,null,null,{"$f":"COUNTA(H2530:BA2530)-COUNTIF(H2530:BA2530,\"*-*\")","v":0}]
[]
[null,null,null,null,148,null,"t148",null,null,null,null,null,null,null,null,null,null,null,null,null,null,null,null,null,null,null,null,null,null,null,null,null,null,null,null,null,null,null,null,null,null,null,null,null,null,null,null,null,null,null,null,null,null,{"$f":"COUNTA(H2532:BA2532)-COUNTIF(H2532:BA2532,\"*-*\")","v":0}]
[]
[null,null,null,null,149,null,"t149",null,null,null,null,null,null,null,null,null,null,null,null,null,null,null,null,null,null,null,null,null,null,null,null,null,null,null,null,null,null,null,null,null,null,null,null,null,null,null,null,null,null,null,null,null,null,{"$f":"COUNTA(H2534:BA2534)-COUNTIF(H2534:BA2534,\"*-*\")","v":0}]
[null,null,null,null,null,"庭"]
[null,null,null,null,150,null,"t150",null,null,null,null,null,null,null,null,null,null,null,null,null,null,null,null,null,null,null,null,null,null,null,null,null,null,null,null,null,null,null,null,null,null,null,null,null,null,null,null,null,null,null,null,null,null,{"$f":"COUNTA(H2536:BA2536)-COUNTIF(H2536:BA2536,\"*-*\")","v":0}]
[]
[null,null,null,null,151,null,"宮木",null,null,null,null,null,null,null,null,"*","*","*","*","*",null,null,null,"*","*","*","*",null,null,null,null,"学年会",null,null,null,null,null,null,null,null,null,null,null,"教育課",null,null,null,null,null,null,null,null,null,{"$f":"COUNTA(H2538:BA2538)-COUNTIF(H2538:BA2538,\"*-*\")","v":11}]
[null,null,null,null,null,null,"1-8副"]
[null,null,null,null,152,"情","t152",null,null,null,null,null,null,null,null,null,null,null,null,null,null,null,null,null,null,null,null,null,null,null,null,null,null,null,null,null,null,null,null,null,null,null,null,null,null,null,null,null,null,null,null,null,null,{"$f":"COUNTA(H2540:BA2540)-COUNTIF(H2540:BA2540,\"*-*\")","v":0}]
[]
[null,null,null,null,153,null,"t153",null,null,null,null,null,null,null,null,null,null,null,null,null,null,null,null,null,null,null,null,null,null,null,null,null,null,null,null,null,null,null,null,null,null,null,null,null,null,null,null,null,null,null,null,null,null,{"$f":"COUNTA(H2542:BA2542)-COUNTIF(H2542:BA2542,\"*-*\")","v":0}]
[]
[null,null,null,null,154,null,"t154",null,null,null,null,null,null,null,null,null,null,null,null,null,null,null,null,null,null,null,null,null,null,null,null,null,null,null,null,null,null,null,null,null,null,null,null,null,null,null,null,null,null,null,null,null,null,{"$f":"COUNTA(H2544:BA2544)-COUNTIF(H2544:BA2544,\"*-*\")","v":0}]
[]
[null,null,null,null,155,null,"t155",null,null,null,null,null,null,null,null,null,null,null,null,null,null,null,null,null,null,null,null,null,null,null,null,null,null,null,null,null,null,null,null,null,null,null,null,null,null,null,null,null,null,null,null,null,null,{"$f":"COUNTA(H2546:BA2546)-COUNTIF(H2546:BA2546,\"*-*\")","v":0}]
[]
[null,null,null,null,156,null,"t156",null,null,null,null,null,null,null,null,null,null,null,null,null,null,null,null,null,null,null,null,null,null,null,null,null,null,null,null,null,null,null,null,null,null,null,null,null,null,null,null,null,null,null,null,null,null,{"$f":"COUNTA(H2548:BA2548)-COUNTIF(H2548:BA2548,\"*-*\")","v":0}]
[]
[null,null,null,null,157,null,"t157",null,null,null,null,null,null,null,null,null,null,null,null,null,null,null,null,null,null,null,null,null,null,null,null,null,null,null,null,null,null,null,null,null,null,null,null,null,null,null,null,null,null,null,null,null,null,{"$f":"COUNTA(H2550:BA2550)-COUNTIF(H2550:BA2550,\"*-*\")","v":0}]
[]
[null,null,null,null,158,null,"t158",null,null,null,null,null,null,null,null,null,null,null,null,null,null,null,null,null,null,null,null,null,null,null,null,null,null,null,null,null,null,null,null,null,null,null,null,null,null,null,null,null,null,null,null,null,null,{"$f":"COUNTA(H2552:BA2552)-COUNTIF(H2552:BA2552,\"*-*\")","v":0}]
[]
[null,null,null,null,159,null,"t159",null,null,null,null,null,null,null,null,null,null,null,null,null,null,null,null,null,null,null,null,null,null,null,null,null,null,null,null,null,null,null,null,null,null,null,null,null,null,null,null,null,null,null,null,null,null,{"$f":"COUNTA(H2554:BA2554)-COUNTIF(H2554:BA2554,\"*-*\")","v":0}]
[null,null,null,null,null,"報"]
[null,null,null,null,160,null,"t160",null,null,null,null,null,null,null,null,null,null,null,null,null,null,null,null,null,null,null,null,null,null,null,null,null,null,null,null,null,null,null,null,null,null,null,null,null,null,null,null,null,null,null,null,null,null,{"$f":"COUNTA(H2556:BA2556)-COUNTIF(H2556:BA2556,\"*-*\")","v":0}]
[]
[null,null,null,null,161,null,"t161",null,null,null,null,null,null,null,null,null,null,null,null,null,null,null,null,null,null,null,null,null,null,null,null,null,null,null,null,null,null,null,null,null,null,null,null,null,null,null,null,null,null,null,null,null,null,{"$f":"COUNTA(H2558:BA2558)-COUNTIF(H2558:BA2558,\"*-*\")","v":0}]
[]
[null,null,null,null,162,"専","t162",null,null,null,null,null,null,null,null,null,null,null,null,null,null,null,null,null,null,null,null,null,null,null,null,null,null,null,null,null,null,null,null,null,null,null,null,null,null,null,null,null,null,null,null,null,null,{"$f":"COUNTA(H2560:BA2560)-COUNTIF(H2560:BA2560,\"*-*\")","v":0}]
[]
[null,null,null,null,163,null,"t163",null,null,null,null,null,null,null,null,null,null,null,null,null,null,null,null,null,null,null,null,null,null,null,null,null,null,null,null,null,null,null,null,null,null,null,null,null,null,null,null,null,null,null,null,null,null,{"$f":"COUNTA(H2562:BA2562)-COUNTIF(H2562:BA2562,\"*-*\")","v":0}]
[]
[null,null,null,null,164,null,"t164",null,null,null,null,null,null,null,null,null,null,null,null,null,null,null,null,null,null,null,null,null,null,null,null,null,null,null,null,null,null,null,null,null,null,null,null,null,null,null,null,null,null,null,null,null,null,{"$f":"COUNTA(H2564:BA2564)-COUNTIF(H2564:BA2564,\"*-*\")","v":0}]
[]
[null,null,null,null,165,null,"t165",null,null,null,null,null,null,null,null,null,null,null,null,null,null,null,null,null,null,null,null,null,null,null,null,null,null,null,null,null,null,null,null,null,null,null,null,null,null,null,null,null,null,null,null,null,null,{"$f":"COUNTA(H2566:BA2566)-COUNTIF(H2566:BA2566,\"*-*\")","v":0}]
[]
[null,null,null,null,166,"門","t166",null,null,null,null,null,null,null,null,null,null,null,null,null,null,null,null,null,null,null,null,null,null,null,null,null,null,null,null,null,null,null,null,null,null,null,null,null,null,null,null,null,null,null,null,null,null,{"$f":"COUNTA(H2568:BA2568)-COUNTIF(H2568:BA2568,\"*-*\")","v":0}]
[]
[null,null,null,null,167,null,"t167",null,null,null,null,null,null,null,null,null,null,null,null,null,null,null,null,null,null,null,null,null,null,null,null,null,null,null,null,null,null,null,null,null,null,null,null,null,null,null,null,null,null,null,null,null,null,{"$f":"COUNTA(H2570:BA2570)-COUNTIF(H2570:BA2570,\"*-*\")","v":0}]
[]
[null,null,null,null,168,null,"t168",null,null,null,null,null,null,null,null,null,null,null,null,null,null,null,null,null,null,null,null,null,null,null,null,null,null,null,null,null,null,null,null,null,null,null,null,null,null,null,null,null,null,null,null,null,null,{"$f":"COUNTA(H2572:BA2572)-COUNTIF(H2572:BA2572,\"*-*\")","v":0}]
[]
[null,null,null,null,169,null,"t169",null,null,null,null,null,null,null,null,null,null,null,null,null,null,null,null,null,null,null,null,null,null,null,null,null,null,null,null,null,null,null,null,null,null,null,null,null,null,null,null,null,null,null,null,null,null,{"$f":"COUNTA(H2574:BA2574)-COUNTIF(H2574:BA2574,\"*-*\")","v":0}]
[null,null,null,null,null,"１"]
[null,null,null,null,170,null,"t170",null,null,null,null,null,null,null,null,null,null,null,null,null,null,null,null,null,null,null,null,null,null,null,null,null,null,null,null,null,null,null,null,null,null,null,null,null,null,null,null,null,null,null,null,null,null,{"$f":"COUNTA(H2576:BA2576)-COUNTIF(H2576:BA2576,\"*-*\")","v":0}]
[]
[null,null,null,null,171,null,"t171",null,null,null,null,null,null,null,null,null,null,null,null,null,null,null,null,null,null,null,null,null,null,null,null,null,null,null,null,null,null,null,null,null,null,null,null,null,null,null,null,null,null,null,null,null,null,{"$f":"COUNTA(H2578:BA2578)-COUNTIF(H2578:BA2578,\"*-*\")","v":0}]
[]
[null,null,null,null,172,"専","t172",null,null,null,null,null,null,null,null,null,null,null,null,null,null,null,null,null,null,null,null,null,null,null,null,null,null,null,null,null,null,null,null,null,null,null,null,null,null,null,null,null,null,null,null,null,null,{"$f":"COUNTA(H2580:BA2580)-COUNTIF(H2580:BA2580,\"*-*\")","v":0}]
[]
[null,null,null,null,173,null,"t173",null,null,null,null,null,null,null,null,null,null,null,null,null,null,null,null,null,null,null,null,null,null,null,null,null,null,null,null,null,null,null,null,null,null,null,null,null,null,null,null,null,null,null,null,null,null,{"$f":"COUNTA(H2582:BA2582)-COUNTIF(H2582:BA2582,\"*-*\")","v":0}]
[]
[null,null,null,null,174,null,"t174",null,null,null,null,null,null,null,null,null,null,null,null,null,null,null,null,null,null,null,null,null,null,null,null,null,null,null,null,null,null,null,null,null,null,null,null,null,null,null,null,null,null,null,null,null,null,{"$f":"COUNTA(H2584:BA2584)-COUNTIF(H2584:BA2584,\"*-*\")","v":0}]
[]
[null,null,null,null,175,null,"t175",null,null,null,null,null,null,null,null,null,null,null,null,null,null,null,null,null,null,null,null,null,null,null,null,null,null,null,null,null,null,null,null,null,null,null,null,null,null,null,null,null,null,null,null,null,null,{"$f":"COUNTA(H2586:BA2586)-COUNTIF(H2586:BA2586,\"*-*\")","v":0}]
[]
[null,null,null,null,176,"門","t176",null,null,null,null,null,null,null,null,null,null,null,null,null,null,null,null,null,null,null,null,null,null,null,null,null,null,null,null,null,null,null,null,null,null,null,null,null,null,null,null,null,null,null,null,null,null,{"$f":"COUNTA(H2588:BA2588)-COUNTIF(H2588:BA2588,\"*-*\")","v":0}]
[]
[null,null,null,null,177,null,"t177",null,null,null,null,null,null,null,null,null,null,null,null,null,null,null,null,null,null,null,null,null,null,null,null,null,null,null,null,null,null,null,null,null,null,null,null,null,null,null,null,null,null,null,null,null,null,{"$f":"COUNTA(H2590:BA2590)-COUNTIF(H2590:BA2590,\"*-*\")","v":0}]
[]
[null,null,null,null,178,null,"t178",null,null,null,null,null,null,null,null,null,null,null,null,null,null,null,null,null,null,null,null,null,null,null,null,null,null,null,null,null,null,null,null,null,null,null,null,null,null,null,null,null,null,null,null,null,null,{"$f":"COUNTA(H2592:BA2592)-COUNTIF(H2592:BA2592,\"*-*\")","v":0}]
[]
[null,null,null,null,179,null,"t179",null,null,null,null,null,null,null,null,null,null,null,null,null,null,null,null,null,null,null,null,null,null,null,null,null,null,null,null,null,null,null,null,null,null,null,null,null,null,null,null,null,null,null,null,null,null,{"$f":"COUNTA(H2594:BA2594)-COUNTIF(H2594:BA2594,\"*-*\")","v":0}]
[null,null,null,null,null,"２"]
[null,null,null,null,180,null,"t180",null,null,null,null,null,null,null,null,null,null,null,null,null,null,null,null,null,null,null,null,null,null,null,null,null,null,null,null,null,null,null,null,null,null,null,null,null,null,null,null,null,null,null,null,null,null,{"$f":"COUNTA(H2596:BA2596)-COUNTIF(H2596:BA2596,\"*-*\")","v":0}]
[]
[null,null,null,null,181,null,"t181",null,null,null,null,null,null,null,null,null,null,null,null,null,null,null,null,null,null,null,null,null,null,null,null,null,null,null,null,null,null,null,null,null,null,null,null,null,null,null,null,null,null,null,null,null,null,{"$f":"COUNTA(H2598:BA2598)-COUNTIF(H2598:BA2598,\"*-*\")","v":0}]
[]
[null,null,null,null,182,"専","t182",null,null,null,null,null,null,null,null,null,null,null,null,null,null,null,null,null,null,null,null,null,null,null,null,null,null,null,null,null,null,null,null,null,null,null,null,null,null,null,null,null,null,null,null,null,null,{"$f":"COUNTA(H2600:BA2600)-COUNTIF(H2600:BA2600,\"*-*\")","v":0}]
[]
[null,null,null,null,183,null,"t183",null,null,null,null,null,null,null,null,null,null,null,null,null,null,null,null,null,null,null,null,null,null,null,null,null,null,null,null,null,null,null,null,null,null,null,null,null,null,null,null,null,null,null,null,null,null,{"$f":"COUNTA(H2602:BA2602)-COUNTIF(H2602:BA2602,\"*-*\")","v":0}]
[]
[null,null,null,null,184,null,"t184",null,null,null,null,null,null,null,null,null,null,null,null,null,null,null,null,null,null,null,null,null,null,null,null,null,null,null,null,null,null,null,null,null,null,null,null,null,null,null,null,null,null,null,null,null,null,{"$f":"COUNTA(H2604:BA2604)-COUNTIF(H2604:BA2604,\"*-*\")","v":0}]
[]
[null,null,null,null,185,null,"t185",null,null,null,null,null,null,null,null,null,null,null,null,null,null,null,null,null,null,null,null,null,null,null,null,null,null,null,null,null,null,null,null,null,null,null,null,null,null,null,null,null,null,null,null,null,null,{"$f":"COUNTA(H2606:BA2606)-COUNTIF(H2606:BA2606,\"*-*\")","v":0}]
[]
[null,null,null,null,186,"門","t186",null,null,null,null,null,null,null,null,null,null,null,null,null,null,null,null,null,null,null,null,null,null,null,null,null,null,null,null,null,null,null,null,null,null,null,null,null,null,null,null,null,null,null,null,null,null,{"$f":"COUNTA(H2608:BA2608)-COUNTIF(H2608:BA2608,\"*-*\")","v":0}]
[]
[null,null,null,null,187,null,"t187",null,null,null,null,null,null,null,null,null,null,null,null,null,null,null,null,null,null,null,null,null,null,null,null,null,null,null,null,null,null,null,null,null,null,null,null,null,null,null,null,null,null,null,null,null,null,{"$f":"COUNTA(H2610:BA2610)-COUNTIF(H2610:BA2610,\"*-*\")","v":0}]
[]
[null,null,null,null,188,null,"t188",null,null,null,null,null,null,null,null,null,null,null,null,null,null,null,null,null,null,null,null,null,null,null,null,null,null,null,null,null,null,null,null,null,null,null,null,null,null,null,null,null,null,null,null,null,null,{"$f":"COUNTA(H2612:BA2612)-COUNTIF(H2612:BA2612,\"*-*\")","v":0}]
[]
[null,null,null,null,189,null,"t189",null,null,null,null,null,null,null,null,null,null,null,null,null,null,null,null,null,null,null,null,null,null,null,null,null,null,null,null,null,null,null,null,null,null,null,null,null,null,null,null,null,null,null,null,null,null,{"$f":"COUNTA(H2614:BA2614)-COUNTIF(H2614:BA2614,\"*-*\")","v":0}]
[null,null,null,null,null,"３"]
[null,null,null,null,190,null,"t190",null,null,null,null,null,null,null,null,null,null,null,null,null,null,null,null,null,null,null,null,null,null,null,null,null,null,null,null,null,null,null,null,null,null,null,null,null,null,null,null,null,null,null,null,null,null,{"$f":"COUNTA(H2616:BA2616)-COUNTIF(H2616:BA2616,\"*-*\")","v":0}]
[]
[null,null,null,null,191,null,"t191",null,null,null,null,null,null,null,null,null,null,null,null,null,null,null,null,null,null,null,null,null,null,null,null,null,null,null,null,null,null,null,null,null,null,null,null,null,null,null,null,null,null,null,null,null,null,{"$f":"COUNTA(H2618:BA2618)-COUNTIF(H2618:BA2618,\"*-*\")","v":0}]
[]
[null,null,null,null,192,"専","t192",null,null,null,null,null,null,null,null,null,null,null,null,null,null,null,null,null,null,null,null,null,null,null,null,null,null,null,null,null,null,null,null,null,null,null,null,null,null,null,null,null,null,null,null,null,null,{"$f":"COUNTA(H2620:BA2620)-COUNTIF(H2620:BA2620,\"*-*\")","v":0}]
[]
[null,null,null,null,193,null,"t193",null,null,null,null,null,null,null,null,null,null,null,null,null,null,null,null,null,null,null,null,null,null,null,null,null,null,null,null,null,null,null,null,null,null,null,null,null,null,null,null,null,null,null,null,null,null,{"$f":"COUNTA(H2622:BA2622)-COUNTIF(H2622:BA2622,\"*-*\")","v":0}]
[]
[null,null,null,null,194,null,"t194",null,null,null,null,null,null,null,null,null,null,null,null,null,null,null,null,null,null,null,null,null,null,null,null,null,null,null,null,null,null,null,null,null,null,null,null,null,null,null,null,null,null,null,null,null,null,{"$f":"COUNTA(H2624:BA2624)-COUNTIF(H2624:BA2624,\"*-*\")","v":0}]
[]
[null,null,null,null,195,null,"t195",null,null,null,null,null,null,null,null,null,null,null,null,null,null,null,null,null,null,null,null,null,null,null,null,null,null,null,null,null,null,null,null,null,null,null,null,null,null,null,null,null,null,null,null,null,null,{"$f":"COUNTA(H2626:BA2626)-COUNTIF(H2626:BA2626,\"*-*\")","v":0}]
[]
[null,null,null,null,196,"門","t196",null,null,null,null,null,null,null,null,null,null,null,null,null,null,null,null,null,null,null,null,null,null,null,null,null,null,null,null,null,null,null,null,null,null,null,null,null,null,null,null,null,null,null,null,null,null,{"$f":"COUNTA(H2628:BA2628)-COUNTIF(H2628:BA2628,\"*-*\")","v":0}]
[]
[null,null,null,null,197,null,"t197",null,null,null,null,null,null,null,null,null,null,null,null,null,null,null,null,null,null,null,null,null,null,null,null,null,null,null,null,null,null,null,null,null,null,null,null,null,null,null,null,null,null,null,null,null,null,{"$f":"COUNTA(H2630:BA2630)-COUNTIF(H2630:BA2630,\"*-*\")","v":0}]
[]
[null,null,null,null,198,null,"t198",null,null,null,null,null,null,null,null,null,null,null,null,null,null,null,null,null,null,null,null,null,null,null,null,null,null,null,null,null,null,null,null,null,null,null,null,null,null,null,null,null,null,null,null,null,null,{"$f":"COUNTA(H2632:BA2632)-COUNTIF(H2632:BA2632,\"*-*\")","v":0}]
[]
[null,null,null,null,199,null,"t199",null,null,null,null,null,null,null,null,null,null,null,null,null,null,null,null,null,null,null,null,null,null,null,null,null,null,null,null,null,null,null,null,null,null,null,null,null,null,null,null,null,null,null,null,null,null,{"$f":"COUNTA(H2634:BA2634)-COUNTIF(H2634:BA2634,\"*-*\")","v":0}]
[null,null,null,null,null,"４"]
[null,null,null,null,200,null,"t200",null,null,null,null,null,null,null,null,null,null,null,null,null,null,null,null,null,null,null,null,null,null,null,null,null,null,null,null,null,null,null,null,null,null,null,null,null,null,null,null,null,null,null,null,null,null,{"$f":"COUNTA(H2636:BA2636)-COUNTIF(H2636:BA2636,\"*-*\")","v":0}]
[]
[null,null,null,null,201,null,"t201",null,null,null,null,null,null,null,null,null,null,null,null,null,null,null,null,null,null,null,null,null,null,null,null,null,null,null,null,null,null,null,null,null,null,null,null,null,null,null,null,null,null,null,null,null,null,{"$f":"COUNTA(H2638:BA2638)-COUNTIF(H2638:BA2638,\"*-*\")","v":0}]
[]
[null,null,null,null,202,"専","t202",null,null,null,null,null,null,null,null,null,null,null,null,null,null,null,null,null,null,null,null,null,null,null,null,null,null,null,null,null,null,null,null,null,null,null,null,null,null,null,null,null,null,null,null,null,null,{"$f":"COUNTA(H2640:BA2640)-COUNTIF(H2640:BA2640,\"*-*\")","v":0}]
[]
[null,null,null,null,203,null,"t203",null,null,null,null,null,null,null,null,null,null,null,null,null,null,null,null,null,null,null,null,null,null,null,null,null,null,null,null,null,null,null,null,null,null,null,null,null,null,null,null,null,null,null,null,null,null,{"$f":"COUNTA(H2642:BA2642)-COUNTIF(H2642:BA2642,\"*-*\")","v":0}]
[]
[null,null,null,null,204,null,"t204",null,null,null,null,null,null,null,null,null,null,null,null,null,null,null,null,null,null,null,null,null,null,null,null,null,null,null,null,null,null,null,null,null,null,null,null,null,null,null,null,null,null,null,null,null,null,{"$f":"COUNTA(H2644:BA2644)-COUNTIF(H2644:BA2644,\"*-*\")","v":0}]
[]
[null,null,null,null,205,null,"t205",null,null,null,null,null,null,null,null,null,null,null,null,null,null,null,null,null,null,null,null,null,null,null,null,null,null,null,null,null,null,null,null,null,null,null,null,null,null,null,null,null,null,null,null,null,null,{"$f":"COUNTA(H2646:BA2646)-COUNTIF(H2646:BA2646,\"*-*\")","v":0}]
[]
[null,null,null,null,206,"門","t206",null,null,null,null,null,null,null,null,null,null,null,null,null,null,null,null,null,null,null,null,null,null,null,null,null,null,null,null,null,null,null,null,null,null,null,null,null,null,null,null,null,null,null,null,null,null,{"$f":"COUNTA(H2648:BA2648)-COUNTIF(H2648:BA2648,\"*-*\")","v":0}]
[]
[null,null,null,null,207,null,"t207",null,null,null,null,null,null,null,null,null,null,null,null,null,null,null,null,null,null,null,null,null,null,null,null,null,null,null,null,null,null,null,null,null,null,null,null,null,null,null,null,null,null,null,null,null,null,{"$f":"COUNTA(H2650:BA2650)-COUNTIF(H2650:BA2650,\"*-*\")","v":0}]
[]
[null,null,null,null,208,null,"t208",null,null,null,null,null,null,null,null,null,null,null,null,null,null,null,null,null,null,null,null,null,null,null,null,null,null,null,null,null,null,null,null,null,null,null,null,null,null,null,null,null,null,null,null,null,null,{"$f":"COUNTA(H2652:BA2652)-COUNTIF(H2652:BA2652,\"*-*\")","v":0}]
[]
[null,null,null,null,209,null,"t209",null,null,null,null,null,null,null,null,null,null,null,null,null,null,null,null,null,null,null,null,null,null,null,null,null,null,null,null,null,null,null,null,null,null,null,null,null,null,null,null,null,null,null,null,null,null,{"$f":"COUNTA(H2654:BA2654)-COUNTIF(H2654:BA2654,\"*-*\")","v":0}]
[null,null,null,null,null,"５"]
[null,null,null,null,210," ","t210",null,null,null,null,null,null,null,null,null,null,null,null,null,null,null,null,null,null,null,null,null,null,null,null,null,null,null,null,null,null,null,null,null,null,null,null,null,null,null,null,null,null,null,null,null,null,{"$f":"COUNTA(H2656:BA2656)-COUNTIF(H2656:BA2656,\"*-*\")","v":0}]
[]
[null,null,null,null,null,null,null,null,null,null,null,null,null,null,null,null,null,null,null,null,null,null,null,null,null,null,null,null,null,null,null,null,null,null,null,null,null,null,null,null,null,null,null,null,null,null,null,null,null,null,null,null,null,{"$f":"SUM(BB2238:BB2657)","v":197}]
[]
[]
[null,null,null,null,null,null,"時間割〔ｸﾗｽ・特別教室別1〕中間入力"]
[null,null,null,null,null,null,null,null,null,null,"  月",null,null,null,null,null,null,null,"　火",null,null,null,null,null,null,null,"　水",null,null,null,null,null,null,null,"  木",null,null,null,null,null,null,null,"  金",null,null,null,null,null,null,"　土"]
[null,null,null,null,null,null,null,1,2,3,4,5,6,7,8,1,2,3,4,5,6,7,8,1,2,3,4,5,6,7,8,1,2,3,4,5,6,7,8,1,2,3,4,5,6,7,8,1,2,3,4,5,6]
[null,null,null,null,null,null,"ｺﾒﾝﾄ１",null,null,null,null,null,null,"*","*",null,null,null,null,null,null,"*","*",null,null,null,null,null,null,"*","*",null,null,null,null,null,null,"*","*",null,null,null,null,null,"土1,2","*","*",null,null,"必修ク","必修ク","*","*"]
[null,null,null,null,null,null,"ｺﾒﾝﾄ２",null,null,null,null,null,null,"*","*",null,null,null,null,null,null,"*","*",null,null,null,null,null,null,"*","*",null,null,null,null,null,null,"*","*",null,null,null,null,null,"-","*","*",null,null,"-","-","*","*"]
[]
[]
[]
[null,null,null,null,null,null,"時間割〔ｸﾗｽ・特別教室別2〕中間入力"]
[null,null,null,null,null,"ｺﾒﾝﾄ１",null,null,null,null,"  月",null,null,null,null,null,null,null,"　火",null,null,null,null,null,null,null,"　水",null,null,null,null,null,null,null,"  木",null,null,null,null,null,null,null,"  金",null,null,null,null,null,null,"　土"]
[null,null,null,null,null,"ｺﾒﾝﾄ２","ｸﾗｽ",1,2,3,4,5,6,7,8,1,2,3,4,5,6,7,8,1,2,3,4,5,6,7,8,1,2,3,4,5,6,7,8,1,2,3,4,5,6,7,8,1,2,3,4,5,6]
[null,null,null,null,null,null,"1-1","体育",null,null,null,null,null,null,null,null,null,null,null,"保健","体育",null,null,null,null,null,"体育",null,null,null,null,null,null,"家庭","家庭",null,null,null,null,null,null,"音楽","音楽"]
[null,null,null,null,null,null,null,"名児耶  国延",null,null,null,null,null,null,null,null,null,null,null,"山崎","名児耶  大徳",null,null,null,null,null,"名児耶  国延",null,null,null,null,null,null,"村山","村山",null,null,null,null,null,null,"後藤","後藤"]
[null,null,null,null,null,null,"1-2","体育",null,null,null,null,null,null,null,"家庭","家庭",null,null,null,"体育",null,null,null,null,null,"体育","美術","美術",null,null,"保健"]
[null,null,null,null,null,null,null,"名児耶  国延",null,null,null,null,null,null,null,"村山","村山",null,null,null,"名児耶  大徳",null,null,null,null,null,"名児耶  国延","杉山","杉山",null,null,"山崎"]
[null,null,null,null,null,null,"1-3",null,"体育",null,null,"家庭","家庭",null,null,null,null,null,"体育",null,null,null,null,null,null,null,null,"書道","書道",null,null,null,null,null,null,"保健",null,null,null,"体育"]
[null,null,null,null,null,null,null,null,"名児耶  大徳",null,null,"村山","村山",null,null,null,null,null,"名児耶  国延",null,null,null,null,null,null,null,null,"高橋","高橋",null,null,null,null,null,null,"山崎",null,null,null,"名児耶  国延"]
[null,null,null,null,null,null,"1-4",null,"体育",null,null,"音楽","音楽",null,null,null,null,"保健","体育",null,null,null,null,null,null,null,null,null,null,null,null,null,null,null,null,null,null,null,null,"体育",null,"家庭","家庭"]
[null,null,null,null,null,null,null,null,"名児耶  大徳",null,null,"上原","上原",null,null,null,null,"名児耶","名児耶  国延",null,null,null,null,null,null,null,null,null,null,null,null,null,null,null,null,null,null,null,null,"名児耶  国延",null,"村山","村山"]
[null,null,null,null,null,null,"1-5",null,"体育","家庭","家庭",null,null,null,null,"美術","美術",null,null,null,null,null,null,"体育",null,null,null,null,null,null,null,null,null,null,null,null,null,null,null,null,null,"体育","保健"]
[null,null,null,null,null,null,null,null,"国延  八木","川崎","川崎",null,null,null,null,"杉山","杉山",null,null,null,null,null,null,"国延  八木",null,null,null,null,null,null,null,null,null,null,null,null,null,null,null,null,null,"国延  大徳","名児耶"]
[null,null,null,null,null,null,"1-6",null,"体育",null,null,null,null,null,null,"音楽","音楽",null,null,"保健",null,null,null,"体育",null,null,null,null,null,null,null,"家庭","家庭",null,null,null,null,null,null,null,null,"体育"]
[null,null,null,null,null,null,null,null,"国延  八木",null,null,null,null,null,null,"上原","上原",null,null,"国延",null,null,null,"国延  八木",null,null,null,null,null,null,null,"川崎","川崎",null,null,null,null,null,null,null,null,"国延  大徳"]
[null,null,null,null,null,null,"1-7",null,null,null,null,"体育",null,null,null,"体育",null,null,null,"家庭","家庭",null,null,null,null,null,null,null,null,null,null,null,null,"体育",null,null,null,null,null,null,null,"美術","美術","保健"]
[null,null,null,null,null,null,null,null,null,null,null,"国延  山崎",null,null,null,"国延  大徳",null,null,null,"川崎","川崎",null,null,null,null,null,null,null,null,null,null,null,null,"国延  山崎",null,null,null,null,null,null,null,"杉山","杉山","国延"]
[null,null,null,null,null,null,"1-8",null,null,null,null,"体育",null,null,null,"体育",null,"家庭","家庭",null,null,null,null,null,null,"保健",null,null,null,null,null,null,null,"体育",null,null,null,null,null,null,null,"書道","書道"]
[null,null,null,null,null,null,null,null,null,null,null,"国延  山崎",null,null,null,"国延  大徳",null,"川崎","川崎",null,null,null,null,null,null,"国延",null,null,null,null,null,null,null,"国延  山崎",null,null,null,null,null,null,null,"高橋","高橋"]
[null,null,null,null,null,null,"1-9"]
[]
[null,null,null,null,null,null,"1-10"]
[]
[null,null,null,null,null,null,"1-11"]
[]
[null,null,null,null,null,null,"1-12"]
[]
[null,null,null,null,null,null,"1-13"]
[]
[null,null,null,null,null,null,"1-14"]
[]
[null,null,null,null,null,null,"1-15"]
[]
[null,null,null,null,null,null,"1-16"]
[]
[null,null,null,null,null,null,"1-17"]
[]
[null,null,null,null,null,null,"1-18"]
[]
[null,null,null,null,null,null,"1-19"]
[]
[null,null,null,null,null,null,"1-20"]
[]
[null,null,null,null,null,null,"2-1",null,null,"芸術","芸術",null,"英Ⅱ",null,null,null,null,null,null,"英Ⅱ","体育",null,null,"英Ⅱ",null,"家庭","家庭",null,null,null,null,null,null,null,"体育",null,null,null,null,null,null,"体育","英Ⅱ","保健"]
[null,null,null,null,null,null,null,null,null,"杉山  高橋  後藤","杉山  高橋  後藤",null,"小井川  清水ﾖ",null,null,null,null,null,null,"小井川  清水ﾖ","八木  井上",null,null,"小井川  清水ﾖ",null,"村山","村山",null,null,null,null,null,null,null,"八木  井上",null,null,null,null,null,null,"八木  井上","小井川  清水ﾖ","八木"]
[null,null,null,null,null,null,"2-2",null,null,"芸術","芸術",null,"英Ⅱ",null,null,"保健",null,"家庭","家庭","英Ⅱ","体育",null,null,"英Ⅱ",null,null,null,null,null,null,null,null,null,null,"体育",null,null,null,null,null,null,"体育","英Ⅱ"]
[null,null,null,null,null,null,null,null,null,"杉山  高橋  後藤","杉山  高橋  後藤",null,"小井川  清水ﾀ",null,null,"八木",null,"村山","村山","小井川  清水ﾀ","八木  井上",null,null,"小井川  清水ﾀ",null,null,null,null,null,null,null,null,null,null,"八木  井上",null,null,null,null,null,null,"八木  井上","小井川  清水ﾀ"]
[null,null,null,null,null,null,"2-3","体育","英Ⅱ","芸術","芸術",null,null,null,null,null,null,"体育",null,null,"英Ⅱ",null,null,"家庭","家庭","英Ⅱ","保健",null,null,null,null,"体育",null,null,null,null,null,null,null,null,"英Ⅱ"]
[null,null,null,null,null,null,null,"仙徳  大徳","清水ﾖ 松田","杉山  高橋  後藤","杉山  高橋  後藤",null,null,null,null,null,null,"仙徳  大徳",null,null,"清水ﾖ 松田",null,null,"村山","村山","清水ﾖ 松田","井上",null,null,null,null,"仙徳  大徳",null,null,null,null,null,null,null,null,"清水ﾖ 松田"]
[null,null,null,null,null,null,"2-4","体育","英Ⅱ","家庭","家庭",null,null,null,null,null,null,"体育","保健",null,"英Ⅱ",null,null,null,null,"英Ⅱ",null,null,null,null,null,"体育",null,"芸術","芸術",null,null,null,null,null,"英Ⅱ"]
[null,null,null,null,null,null,null,"仙徳  大徳","清水ﾖ 加藤","村山","村山",null,null,null,null,null,null,"仙徳  大徳","井上",null,"清水ﾖ 加藤",null,null,null,null,"清水ﾖ 加藤",null,null,null,null,null,"仙徳  大徳",null,"高橋  後藤  秦","高橋  後藤  秦",null,null,null,null,null,"清水ﾖ 加藤"]
[null,null,null,null,null,null,"2-5",null,"英Ⅱ",null,null,"保健",null,null,null,"家庭","家庭","英Ⅱ",null,null,null,null,null,null,null,"体育",null,null,"英Ⅱ",null,null,null,null,"芸術","芸術","体育",null,null,null,"体育",null,null,null,null,null,null,null,null,"英Ⅱ"]
[null,null,null,null,null,null,null,null,"清水ﾀ 舘",null,null,"大徳",null,null,null,"寺西","寺西","清水ﾀ 舘",null,null,null,null,null,null,null,"八木  大徳",null,null,"清水ﾀ 舘",null,null,null,null,"高橋  後藤  秦","高橋  後藤  秦","八木  大徳",null,null,null,"八木  大徳",null,null,null,null,null,null,null,null,"清水ﾀ 舘"]
[null,null,null,null,null,null,"2-6",null,"英Ⅱ",null,null,null,null,null,null,null,null,"英Ⅱ",null,null,null,null,null,null,"保健","体育",null,null,"英Ⅱ",null,null,null,null,"芸術","芸術","体育",null,null,null,"体育",null,"家庭","家庭",null,null,null,null,null,"英Ⅱ"]
[null,null,null,null,null,null,null,null,"小井川  清水ﾀ",null,null,null,null,null,null,null,null,"小井川  清水ﾀ",null,null,null,null,null,null,"大徳","八木  大徳",null,null,"小井川  清水ﾀ",null,null,null,null,"高橋  後藤  秦","高橋  後藤  秦","八木  大徳",null,null,null,"八木  大徳",null,"川崎","川崎",null,null,null,null,null,"小井川  清水ﾀ"]
[null,null,null,null,null,null,"2-7",null,null,null,"英Ⅱ","体育",null,null,null,null,null,null,"英Ⅱ","体育",null,null,null,"体育","英Ⅱ",null,"保健",null,null,null,null,"音美","音美",null,null,null,null,null,null,"家庭","家庭",null,null,"英Ⅱ"]
[null,null,null,null,null,null,null,null,null,null,"松田 舘","名児耶  仙徳",null,null,null,null,null,null,"松田 舘","名児耶  仙徳",null,null,null,"名児耶  仙徳","松田 舘",null,"仙徳",null,null,null,null,"後藤    秦","後藤    秦",null,null,null,null,null,null,"川崎","川崎",null,null,"松田 舘"]
[null,null,null,null,null,null,"2-8",null,null,null,"英Ⅱ","体育",null,null,null,null,null,null,"英Ⅱ","体育",null,null,null,"体育","英Ⅱ",null,null,"家庭","家庭",null,null,"音美","音美",null,null,null,null,null,null,null,"保健",null,null,"英Ⅱ"]
[null,null,null,null,null,null,null,null,null,null,"加藤 舘","名児耶  仙徳",null,null,null,null,null,null,"加藤 舘","名児耶  仙徳",null,null,null,"名児耶  仙徳","加藤 舘",null,null,"川崎","川崎",null,null,"後藤    秦","後藤    秦",null,null,null,null,null,null,null,"仙徳",null,null,"加藤 舘"]
[null,null,null,null,null,null,"2-9"]
[]
[null,null,null,null,null,null,"2-10"]
[]
[null,null,null,null,null,null,"2-11"]
[]
[null,null,null,null,null,null,"2-12"]
[]
[null,null,null,null,null,null,"2-13"]
[]
[null,null,null,null,null,null,"2-14"]
[]
[null,null,null,null,null,null,"2-15"]
[]
[null,null,null,null,null,null,"2-16"]
[]
[null,null,null,null,null,null,"2-17"]
[]
[null,null,null,null,null,null,"2-18"]
[]
[null,null,null,null,null,null,"2-19"]
[]
[null,null,null,null,null,null,"2-20"]
[]
[null,null,null,null,null,null,"3-1","芸術","芸術",null,"体育",null,null,null,null,null,null,"現文",null,null,null,null,null,null,null,null,null,null,null,null,null,"現文","体育",null,null,null,null,null,null,null,"体育","現文"]
[null,null,null,null,null,null,null,"杉山  高橋  後藤","杉山  高橋  後藤",null,"国延  仙徳  山崎  井上",null,null,null,null,null,null,"千田",null,null,null,null,null,null,null,null,null,null,null,null,null,"千田","国延  仙徳  山崎  井上",null,null,null,null,null,null,null,"名児耶 大徳 山崎  井上","千田"]
[null,null,null,null,null,null,"3-2",null,null,"体育",null,null,null,null,null,null,"体育",null,null,null,null,null,null,"芸術","芸術","食物","食物",null,null,null,null,null,null,null,null,null,null,null,null,null,null,null,"体育"]
[null,null,null,null,null,null,null,null,null,"名児耶 大徳 山崎  井上",null,null,null,null,null,null,"八木  仙徳  山崎  井上",null,null,null,null,null,null,"杉山  高橋  後藤","杉山  高橋  後藤","川崎","川崎",null,null,null,null,null,null,null,null,null,null,null,null,null,null,null,"八木  仙徳  山崎  井上"]
[null,null,null,null,null,null,"3-3",null,null,null,null,null,"体育",null,null,null,null,"表現","現文","芸術","芸術",null,null,null,"体育",null,null,null,null,null,null,null,"現文",null,"表現",null,null,null,null,null,"現文",null,null,"体育"]
[null,null,null,null,null,null,null,null,null,null,null,null,"八木  仙徳  山崎  井上",null,null,null,null,"松本ﾔ 山田","千田","杉山  高橋  後藤","杉山  高橋  後藤",null,null,null,"八木  仙徳  山崎  井上",null,null,null,null,null,null,null,"千田",null,"松本ﾔ 山田",null,null,null,null,null,"千田",null,null,"名児耶 大徳 山崎  井上"]
[null,null,null,null,null,null,"3-4",null,"数Ｃ",null,"体育",null,null,null,null,null,null,null,null,null,null,null,null,"芸術","芸術",null,null,"選体","選体",null,null,null,"体育","数Ｃ",null,null,null,null,null,null,"体育"]
[null,null,null,null,null,null,null,null,"菊川   多田",null,"国延  仙徳  山崎  井上",null,null,null,null,null,null,null,null,null,null,null,null,"杉山  高橋  後藤","杉山  高橋  後藤",null,null,"名 国 八 仙 大 山 井","名 国 八 仙 大 山 井",null,null,null,"国延  仙徳  山崎  井上","菊川   多田",null,null,null,null,null,null,"名児耶 大徳 山崎  井上"]
[null,null,null,null,null,null,"3-5",null,null,"体育",null,null,null,null,null,null,"体育",null,null,"芸術","芸術",null,null,null,null,null,"物化",null,null,null,null,null,null,null,null,null,null,null,null,null,null,null,"体育",null,null,null,null,"物化"]
[null,null,null,null,null,null,null,null,null,"名児耶 大徳 山崎  井上",null,null,null,null,null,null,"八木  仙徳  山崎  井上",null,null,"杉山  高橋  後藤","杉山  高橋  後藤",null,null,null,null,null,"関   斉藤ｻ",null,null,null,null,null,null,null,null,null,null,null,null,null,null,null,"八木  仙徳  山崎  井上",null,null,null,null,"関   斉藤ｻ"]
[null,null,null,null,null,null,"3-6","芸術","芸術",null,null,null,"体育",null,null,null,null,null,null,null,null,null,null,null,"体育",null,null,null,null,null,null,null,null,null,null,null,null,null,null,null,null,null,null,"体育"]
[null,null,null,null,null,null,null,"杉山  高橋  後藤","杉山  高橋  後藤",null,null,null,"八木  仙徳  山崎  井上",null,null,null,null,null,null,null,null,null,null,null,"八木  仙徳  山崎  井上",null,null,null,null,null,null,null,null,null,null,null,null,null,null,null,null,null,null,"名児耶 大徳 山崎  井上"]
[null,null,null,null,null,null,"3-7",null,null,null,null,null,"体育",null,null,null,null,null,null,"芸術","芸術",null,null,null,"体育",null,null,null,null,null,null,null,null,null,null,null,null,null,null,"選芸","選芸",null,null,"体育"]
[null,null,null,null,null,null,null,null,null,null,null,null,"八木  仙徳  山崎  井上",null,null,null,null,null,null,"杉山  高橋  後藤","杉山  高橋  後藤",null,null,null,"八木  仙徳  山崎  井上",null,null,null,null,null,null,null,null,null,null,null,null,null,null,"杉山  高橋  後藤","杉山  高橋  後藤",null,null,"名児耶 大徳 山崎  井上"]
[null,null,null,null,null,null,"3-8","芸術","芸術","体育",null,null,null,null,null,null,"体育",null,"表現",null,null,null,null,null,null,null,null,null,null,null,null,null,null,"表現",null,null,null,null,null,null,null,null,"体育"]
[null,null,null,null,null,null,null,"杉山  高橋  後藤","杉山  高橋  後藤","名児耶 大徳 山崎  井上",null,null,null,null,null,null,"八木  仙徳  山崎  井上",null,"関根  山田",null,null,null,null,null,null,null,null,null,null,null,null,null,null,"関根  山田",null,null,null,null,null,null,null,null,"八木  仙徳  山崎  井上"]
[null,null,null,null,null,null,"3-9"]
[]
[null,null,null,null,null,null,"3-10"]
[]
[null,null,null,null,null,null,"3-11"]
[]
[null,null,null,null,null,null,"3-12"]
[]
[null,null,null,null,null,null,"3-13"]
[]
[null,null,null,null,null,null,"3-14"]
[]
[null,null,null,null,null,null,"3-15"]
[]
[null,null,null,null,null,null,"3-16"]
[]
[null,null,null,null,null,null,"3-17"]
[]
[null,null,null,null,null,null,"3-18"]
[]
[null,null,null,null,null,null,"3-19"]
[]
[null,null,null,null,null,null,"3-20"]
[]
[null,null,null,null,null,null,"*1-1","体育",null,null,null,null,null,null,null,null,null,null,null,"保健","体育",null,null,null,null,null,"体育",null,null,null,null,null,null,"家庭","家庭",null,null,null,null,null,null,"音楽","音楽"]
[null,null,null,null,null,null,null,"名児耶  国延",null,null,null,null,null,null,null,null,null,null,null,"山崎","名児耶  大徳",null,null,null,null,null,"名児耶  国延",null,null,null,null,null,null,"村山","村山",null,null,null,null,null,null,"後藤","後藤"]
[null,null,null,null,null,null,"*1-2","体育",null,null,null,null,null,null,null,"家庭","家庭",null,null,null,"体育",null,null,null,null,null,"体育","美術","美術",null,null,"保健"]
[null,null,null,null,null,null,null,"名児耶  国延",null,null,null,null,null,null,null,"村山","村山",null,null,null,"名児耶  大徳",null,null,null,null,null,"名児耶  国延","杉山","杉山",null,null,"山崎"]
[null,null,null,null,null,null,"*1-3",null,"体育",null,null,"家庭","家庭",null,null,null,null,null,"体育",null,null,null,null,null,null,null,null,"書道","書道",null,null,null,null,null,null,"保健",null,null,null,"体育"]
[null,null,null,null,null,null,null,null,"名児耶  大徳",null,null,"村山","村山",null,null,null,null,null,"名児耶  国延",null,null,null,null,null,null,null,null,"高橋","高橋",null,null,null,null,null,null,"山崎",null,null,null,"名児耶  国延"]
[null,null,null,null,null,null,"*1-4",null,"体育",null,null,"音楽","音楽",null,null,null,null,"保健","体育",null,null,null,null,null,null,null,null,null,null,null,null,null,null,null,null,null,null,null,null,"体育",null,"家庭","家庭"]
[null,null,null,null,null,null,null,null,"名児耶  大徳",null,null,"上原","上原",null,null,null,null,"名児耶","名児耶  国延",null,null,null,null,null,null,null,null,null,null,null,null,null,null,null,null,null,null,null,null,"名児耶  国延",null,"村山","村山"]
[null,null,null,null,null,null,"*1-5",null,"体育","家庭","家庭",null,null,null,null,"美術","美術",null,null,null,null,null,null,"体育",null,null,null,null,null,null,null,null,null,null,null,null,null,null,null,null,null,"体育","保健"]
[null,null,null,null,null,null,null,null,"国延  八木","川崎","川崎",null,null,null,null,"杉山","杉山",null,null,null,null,null,null,"国延  八木",null,null,null,null,null,null,null,null,null,null,null,null,null,null,null,null,null,"国延  大徳","名児耶"]
[null,null,null,null,null,null,"*1-6",null,"体育",null,null,null,null,null,null,"音楽","音楽",null,null,"保健",null,null,null,"体育",null,null,null,null,null,null,null,"家庭","家庭",null,null,null,null,null,null,null,null,"体育"]
[null,null,null,null,null,null,null,null,"国延  八木",null,null,null,null,null,null,"上原","上原",null,null,"国延",null,null,null,"国延  八木",null,null,null,null,null,null,null,"川崎","川崎",null,null,null,null,null,null,null,null,"国延  大徳"]
[null,null,null,null,null,null,"*1-7",null,null,null,null,"体育",null,null,null,"体育",null,null,null,"家庭","家庭",null,null,null,null,null,null,null,null,null,null,null,null,"体育",null,null,null,null,null,null,null,"美術","美術","保健"]
[null,null,null,null,null,null,null,null,null,null,null,"国延  山崎",null,null,null,"国延  大徳",null,null,null,"川崎","川崎",null,null,null,null,null,null,null,null,null,null,null,null,"国延  山崎",null,null,null,null,null,null,null,"杉山","杉山","国延"]
[null,null,null,null,null,null,"*1-8",null,null,null,null,"体育",null,null,null,"体育",null,"家庭","家庭",null,null,null,null,null,null,"保健",null,null,null,null,null,null,null,"体育",null,null,null,null,null,null,null,"書道","書道"]
[null,null,null,null,null,null,null,null,null,null,null,"国延  山崎",null,null,null,"国延  大徳",null,"川崎","川崎",null,null,null,null,null,null,"国延",null,null,null,null,null,null,null,"国延  山崎",null,null,null,null,null,null,null,"高橋","高橋"]
[null,null,null,null,null,null,"*1-9"]
[]
[null,null,null,null,null,null,"*1-10"]
[]
[null,null,null,null,null,null,"*1-11"]
[]
[null,null,null,null,null,null,"*1-12"]
[]
[null,null,null,null,null,null,"*1-13"]
[]
[null,null,null,null,null,null,"*1-14"]
[]
[null,null,null,null,null,null,"*1-15"]
[]
[null,null,null,null,null,null,"*1-16"]
[]
[null,null,null,null,null,null,"*1-17"]
[]
[null,null,null,null,null,null,"*1-18"]
[]
[null,null,null,null,null,null,"*1-19"]
[]
[null,null,null,null,null,null,"*1-20"]
[]
[null,null,null,null,null,null,"*2-1",null,null,"芸術","芸術",null,"英Ⅱ",null,null,null,null,null,null,"英Ⅱ","体育",null,null,"英Ⅱ",null,"家庭","家庭",null,null,null,null,null,null,null,"体育",null,null,null,null,null,null,"体育","英Ⅱ","保健"]
[null,null,null,null,null,null,null,null,null,"杉山  高橋  後藤","杉山  高橋  後藤",null,"小井川  清水ﾖ",null,null,null,null,null,null,"小井川  清水ﾖ","八木  井上",null,null,"小井川  清水ﾖ",null,"村山","村山",null,null,null,null,null,null,null,"八木  井上",null,null,null,null,null,null,"八木  井上","小井川  清水ﾖ","八木"]
[null,null,null,null,null,null,"*2-2",null,null,"芸術","芸術",null,"英Ⅱ",null,null,"保健",null,"家庭","家庭","英Ⅱ","体育",null,null,"英Ⅱ",null,null,null,null,null,null,null,null,null,null,"体育",null,null,null,null,null,null,"体育","英Ⅱ"]
[null,null,null,null,null,null,null,null,null,"杉山  高橋  後藤","杉山  高橋  後藤",null,"小井川  清水ﾀ",null,null,"八木",null,"村山","村山","小井川  清水ﾀ","八木  井上",null,null,"小井川  清水ﾀ",null,null,null,null,null,null,null,null,null,null,"八木  井上",null,null,null,null,null,null,"八木  井上","小井川  清水ﾀ"]
[null,null,null,null,null,null,"*2-3","体育","英Ⅱ","芸術","芸術",null,null,null,null,null,null,"体育",null,null,"英Ⅱ",null,null,"家庭","家庭","英Ⅱ","保健",null,null,null,null,"体育",null,null,null,null,null,null,null,null,"英Ⅱ"]
[null,null,null,null,null,null,null,"仙徳  大徳","清水ﾖ 松田","杉山  高橋  後藤","杉山  高橋  後藤",null,null,null,null,null,null,"仙徳  大徳",null,null,"清水ﾖ 松田",null,null,"村山","村山","清水ﾖ 松田","井上",null,null,null,null,"仙徳  大徳",null,null,null,null,null,null,null,null,"清水ﾖ 松田"]
[null,null,null,null,null,null,"*2-4","体育","英Ⅱ","家庭","家庭",null,null,null,null,null,null,"体育","保健",null,"英Ⅱ",null,null,null,null,"英Ⅱ",null,null,null,null,null,"体育",null,"芸術","芸術",null,null,null,null,null,"英Ⅱ"]
[null,null,null,null,null,null,null,"仙徳  大徳","清水ﾖ 加藤","村山","村山",null,null,null,null,null,null,"仙徳  大徳","井上",null,"清水ﾖ 加藤",null,null,null,null,"清水ﾖ 加藤",null,null,null,null,null,"仙徳  大徳",null,"高橋  後藤  秦","高橋  後藤  秦",null,null,null,null,null,"清水ﾖ 加藤"]
[null,null,null,null,null,null,"*2-5",null,"英Ⅱ",null,null,"保健",null,null,null,"家庭","家庭","英Ⅱ",null,null,null,null,null,null,null,"体育",null,null,"英Ⅱ",null,null,null,null,"芸術","芸術","体育",null,null,null,"体育",null,null,null,null,null,null,null,null,"英Ⅱ"]
[null,null,null,null,null,null,null,null,"清水ﾀ 舘",null,null,"大徳",null,null,null,"寺西","寺西","清水ﾀ 舘",null,null,null,null,null,null,null,"八木  大徳",null,null,"清水ﾀ 舘",null,null,null,null,"高橋  後藤  秦","高橋  後藤  秦","八木  大徳",null,null,null,"八木  大徳",null,null,null,null,null,null,null,null,"清水ﾀ 舘"]
[null,null,null,null,null,null,"*2-6",null,"英Ⅱ",null,null,null,null,null,null,null,null,"英Ⅱ",null,null,null,null,null,null,"保健","体育",null,null,"英Ⅱ",null,null,null,null,"芸術","芸術","体育",null,null,null,"体育",null,"家庭","家庭",null,null,null,null,null,"英Ⅱ"]
[null,null,null,null,null,null,null,null,"小井川  清水ﾀ",null,null,null,null,null,null,null,null,"小井川  清水ﾀ",null,null,null,null,null,null,"大徳","八木  大徳",null,null,"小井川  清水ﾀ",null,null,null,null,"高橋  後藤  秦","高橋  後藤  秦","八木  大徳",null,null,null,"八木  大徳",null,"川崎","川崎",null,null,null,null,null,"小井川  清水ﾀ"]
[null,null,null,null,null,null,"*2-7",null,null,null,"英Ⅱ","体育",null,null,null,null,null,null,"英Ⅱ","体育",null,null,null,"体育","英Ⅱ",null,"保健",null,null,null,null,"音美","音美",null,null,null,null,null,null,"家庭","家庭",null,null,"英Ⅱ"]
[null,null,null,null,null,null,null,null,null,null,"松田 舘","名児耶  仙徳",null,null,null,null,null,null,"松田 舘","名児耶  仙徳",null,null,null,"名児耶  仙徳","松田 舘",null,"仙徳",null,null,null,null,"後藤    秦","後藤    秦",null,null,null,null,null,null,"川崎","川崎",null,null,"松田 舘"]
[null,null,null,null,null,null,"*2-8",null,null,null,"英Ⅱ","体育",null,null,null,null,null,null,"英Ⅱ","体育",null,null,null,"体育","英Ⅱ",null,null,"家庭","家庭",null,null,"音美","音美",null,null,null,null,null,null,null,"保健",null,null,"英Ⅱ"]
[null,null,null,null,null,null,null,null,null,null,"加藤 舘","名児耶  仙徳",null,null,null,null,null,null,"加藤 舘","名児耶  仙徳",null,null,null,"名児耶  仙徳","加藤 舘",null,null,"川崎","川崎",null,null,"後藤    秦","後藤    秦",null,null,null,null,null,null,null,"仙徳",null,null,"加藤 舘"]
[null,null,null,null,null,null,"*2-9"]
[]
[null,null,null,null,null,null,"*2-10"]
[]
[null,null,null,null,null,null,"*2-11"]
[]
[null,null,null,null,null,null,"*2-12"]
[]
[null,null,null,null,null,null,"*2-13"]
[]
[null,null,null,null,null,null,"*2-14"]
[]
[null,null,null,null,null,null,"*2-15"]
[]
[null,null,null,null,null,null,"*2-16"]
[]
[null,null,null,null,null,null,"*2-17"]
[]
[null,null,null,null,null,null,"*2-18"]
[]
[null,null,null,null,null,null,"*2-19"]
[]
[null,null,null,null,null,null,"*2-20"]
[]
[null,null,null,null,null,null,"*3-1","芸術","芸術",null,"体育",null,null,null,null,null,null,"現文",null,null,null,null,null,null,null,null,null,null,null,null,null,"現文","体育",null,null,null,null,null,null,null,"体育","現文"]
[null,null,null,null,null,null,null,"杉山  高橋  後藤","杉山  高橋  後藤",null,"国延  仙徳  山崎  井上",null,null,null,null,null,null,"千田",null,null,null,null,null,null,null,null,null,null,null,null,null,"千田","国延  仙徳  山崎  井上",null,null,null,null,null,null,null,"名児耶 大徳 山崎  井上","千田"]
[null,null,null,null,null,null,"*3-2",null,null,"体育",null,null,null,null,null,null,"体育",null,null,null,null,null,null,"芸術","芸術","食物","食物",null,null,null,null,null,null,null,null,null,null,null,null,null,null,null,"体育"]
[null,null,null,null,null,null,null,null,null,"名児耶 大徳 山崎  井上",null,null,null,null,null,null,"八木  仙徳  山崎  井上",null,null,null,null,null,null,"杉山  高橋  後藤","杉山  高橋  後藤","川崎","川崎",null,null,null,null,null,null,null,null,null,null,null,null,null,null,null,"八木  仙徳  山崎  井上"]
[null,null,null,null,null,null,"*3-3",null,null,null,null,null,"体育",null,null,null,null,"表現","現文","芸術","芸術",null,null,null,"体育",null,null,null,null,null,null,null,"現文",null,"表現",null,null,null,null,null,"現文",null,null,"体育"]
[null,null,null,null,null,null,null,null,null,null,null,null,"八木  仙徳  山崎  井上",null,null,null,null,"松本ﾔ 山田","千田","杉山  高橋  後藤","杉山  高橋  後藤",null,null,null,"八木  仙徳  山崎  井上",null,null,null,null,null,null,null,"千田",null,"松本ﾔ 山田",null,null,null,null,null,"千田",null,null,"名児耶 大徳 山崎  井上"]
[null,null,null,null,null,null,"*3-4",null,"数Ｃ",null,"体育",null,null,null,null,null,null,null,null,null,null,null,null,"芸術","芸術",null,null,"選体","選体",null,null,null,"体育","数Ｃ",null,null,null,null,null,null,"体育"]
[null,null,null,null,null,null,null,null,"菊川   多田",null,"国延  仙徳  山崎  井上",null,null,null,null,null,null,null,null,null,null,null,null,"杉山  高橋  後藤","杉山  高橋  後藤",null,null,"名 国 八 仙 大 山 井","名 国 八 仙 大 山 井",null,null,null,"国延  仙徳  山崎  井上","菊川   多田",null,null,null,null,null,null,"名児耶 大徳 山崎  井上"]
[null,null,null,null,null,null,"*3-5",null,null,"体育",null,null,null,null,null,null,"体育",null,null,"芸術","芸術",null,null,null,null,null,"物化",null,null,null,null,null,null,null,null,null,null,null,null,null,null,null,"体育",null,null,null,null,"物化"]
[null,null,null,null,null,null,null,null,null,"名児耶 大徳 山崎  井上",null,null,null,null,null,null,"八木  仙徳  山崎  井上",null,null,"杉山  高橋  後藤","杉山  高橋  後藤",null,null,null,null,null,"関   斉藤ｻ",null,null,null,null,null,null,null,null,null,null,null,null,null,null,null,"八木  仙徳  山崎  井上",null,null,null,null,"関   斉藤ｻ"]
[null,null,null,null,null,null,"*3-6","芸術","芸術",null,null,null,"体育",null,null,null,null,null,null,null,null,null,null,null,"体育",null,null,null,null,null,null,null,null,null,null,null,null,null,null,null,null,null,null,"体育"]
[null,null,null,null,null,null,null,"杉山  高橋  後藤","杉山  高橋  後藤",null,null,null,"八木  仙徳  山崎  井上",null,null,null,null,null,null,null,null,null,null,null,"八木  仙徳  山崎  井上",null,null,null,null,null,null,null,null,null,null,null,null,null,null,null,null,null,null,"名児耶 大徳 山崎  井上"]
[null,null,null,null,null,null,"*3-7",null,null,null,null,null,"体育",null,null,null,null,null,null,"芸術","芸術",null,null,null,"体育",null,null,null,null,null,null,null,null,null,null,null,null,null,null,"選芸","選芸",null,null,"体育"]
[null,null,null,null,null,null,null,null,null,null,null,null,"八木  仙徳  山崎  井上",null,null,null,null,null,null,"杉山  高橋  後藤","杉山  高橋  後藤",null,null,null,"八木  仙徳  山崎  井上",null,null,null,null,null,null,null,null,null,null,null,null,null,null,"杉山  高橋  後藤","杉山  高橋  後藤",null,null,"名児耶 大徳 山崎  井上"]
[null,null,null,null,null,null,"*3-8","芸術","芸術","体育",null,null,null,null,null,null,"体育",null,"表現",null,null,null,null,null,null,null,null,null,null,null,null,null,null,"表現",null,null,null,null,null,null,null,null,"体育"]
[null,null,null,null,null,null,null,"杉山  高橋  後藤","杉山  高橋  後藤","名児耶 大徳 山崎  井上",null,null,null,null,null,null,"八木  仙徳  山崎  井上",null,"関根  山田",null,null,null,null,null,null,null,null,null,null,null,null,null,null,"関根  山田",null,null,null,null,null,null,null,null,"八木  仙徳  山崎  井上"]
[null,null,null,null,null,null,"*3-9"]
[]
[null,null,null,null,null,null,"*3-10"]
[]
[null,null,null,null,null,null,"*3-11"]
[]
[null,null,null,null,null,null,"*3-12"]
[]
[null,null,null,null,null,null,"*3-13"]
[]
[null,null,null,null,null,null,"*3-14"]
[]
[null,null,null,null,null,null,"*3-15"]
[]
[null,null,null,null,null,null,"*3-16"]
[]
[null,null,null,null,null,null,"*3-17"]
[]
[null,null,null,null,null,null,"*3-18"]
[]
[null,null,null,null,null,null,"*3-19"]
[]
[null,null,null,null,null,null,"*3-20"]
[]
[null,null,null,null,null,null,"1-A","体育",null,null,null,null,null,null,null,null,null,null,null,"保健","体育",null,null,null,null,null,"体育",null,null,null,null,null,null,"家庭","家庭",null,null,null,null,null,null,"音楽","音楽"]
[null,null,null,null,null,null,null,"名児耶  国延",null,null,null,null,null,null,null,null,null,null,null,"山崎","名児耶  大徳",null,null,null,null,null,"名児耶  国延",null,null,null,null,null,null,"村山","村山",null,null,null,null,null,null,"後藤","後藤"]
[null,null,null,null,null,null,"1-B","体育",null,null,null,null,null,null,null,"家庭","家庭",null,null,null,"体育",null,null,null,null,null,"体育","美術","美術",null,null,"保健"]
[null,null,null,null,null,null,null,"名児耶  国延",null,null,null,null,null,null,null,"村山","村山",null,null,null,"名児耶  大徳",null,null,null,null,null,"名児耶  国延","杉山","杉山",null,null,"山崎"]
[null,null,null,null,null,null,"1-C",null,"体育",null,null,"家庭","家庭",null,null,null,null,null,"体育",null,null,null,null,null,null,null,null,"書道","書道",null,null,null,null,null,null,"保健",null,null,null,"体育"]
[null,null,null,null,null,null,null,null,"名児耶  大徳",null,null,"村山","村山",null,null,null,null,null,"名児耶  国延",null,null,null,null,null,null,null,null,"高橋","高橋",null,null,null,null,null,null,"山崎",null,null,null,"名児耶  国延"]
[null,null,null,null,null,null,"1-D",null,"体育",null,null,"音楽","音楽",null,null,null,null,"保健","体育",null,null,null,null,null,null,null,null,null,null,null,null,null,null,null,null,null,null,null,null,"体育",null,"家庭","家庭"]
[null,null,null,null,null,null,null,null,"名児耶  大徳",null,null,"上原","上原",null,null,null,null,"名児耶","名児耶  国延",null,null,null,null,null,null,null,null,null,null,null,null,null,null,null,null,null,null,null,null,"名児耶  国延",null,"村山","村山"]
[null,null,null,null,null,null,"1-E",null,"体育","家庭","家庭",null,null,null,null,"美術","美術",null,null,null,null,null,null,"体育",null,null,null,null,null,null,null,null,null,null,null,null,null,null,null,null,null,"体育","保健"]
[null,null,null,null,null,null,null,null,"国延  八木","川崎","川崎",null,null,null,null,"杉山","杉山",null,null,null,null,null,null,"国延  八木",null,null,null,null,null,null,null,null,null,null,null,null,null,null,null,null,null,"国延  大徳","名児耶"]
[null,null,null,null,null,null,"1-F",null,"体育",null,null,null,null,null,null,"音楽","音楽",null,null,"保健",null,null,null,"体育",null,null,null,null,null,null,null,"家庭","家庭",null,null,null,null,null,null,null,null,"体育"]
[null,null,null,null,null,null,null,null,"国延  八木",null,null,null,null,null,null,"上原","上原",null,null,"国延",null,null,null,"国延  八木",null,null,null,null,null,null,null,"川崎","川崎",null,null,null,null,null,null,null,null,"国延  大徳"]
[null,null,null,null,null,null,"1-G",null,null,null,null,"体育",null,null,null,"体育",null,null,null,"家庭","家庭",null,null,null,null,null,null,null,null,null,null,null,null,"体育",null,null,null,null,null,null,null,"美術","美術","保健"]
[null,null,null,null,null,null,null,null,null,null,null,"国延  山崎",null,null,null,"国延  大徳",null,null,null,"川崎","川崎",null,null,null,null,null,null,null,null,null,null,null,null,"国延  山崎",null,null,null,null,null,null,null,"杉山","杉山","国延"]
[null,null,null,null,null,null,"1-H",null,null,null,null,"体育",null,null,null,"体育",null,"家庭","家庭",null,null,null,null,null,null,"保健",null,null,null,null,null,null,null,"体育",null,null,null,null,null,null,null,"書道","書道"]
[null,null,null,null,null,null,null,null,null,null,null,"国延  山崎",null,null,null,"国延  大徳",null,"川崎","川崎",null,null,null,null,null,null,"国延",null,null,null,null,null,null,null,"国延  山崎",null,null,null,null,null,null,null,"高橋","高橋"]
[null,null,null,null,null,null,"1-I"]
[]
[null,null,null,null,null,null,"1-J"]
[]
[null,null,null,null,null,null,"1-K"]
[]
[null,null,null,null,null,null,"1-L"]
[]
[null,null,null,null,null,null,"1-M"]
[]
[null,null,null,null,null,null,"1-N"]
[]
[null,null,null,null,null,null,"1-O"]
[]
[null,null,null,null,null,null,"1-P"]
[]
[null,null,null,null,null,null,"1-Q"]
[]
[null,null,null,null,null,null,"1-R"]
[]
[null,null,null,null,null,null,"1-S"]
[]
[null,null,null,null,null,null,"1-T"]
[]
[null,null,null,null,null,null,"2-A",null,null,"芸術","芸術",null,"英Ⅱ",null,null,null,null,null,null,"英Ⅱ","体育",null,null,"英Ⅱ",null,"家庭","家庭",null,null,null,null,null,null,null,"体育",null,null,null,null,null,null,"体育","英Ⅱ","保健"]
[null,null,null,null,null,null,null,null,null,"杉山  高橋  後藤","杉山  高橋  後藤",null,"小井川  清水ﾖ",null,null,null,null,null,null,"小井川  清水ﾖ","八木  井上",null,null,"小井川  清水ﾖ",null,"村山","村山",null,null,null,null,null,null,null,"八木  井上",null,null,null,null,null,null,"八木  井上","小井川  清水ﾖ","八木"]
[null,null,null,null,null,null,"2-B",null,null,"芸術","芸術",null,"英Ⅱ",null,null,"保健",null,"家庭","家庭","英Ⅱ","体育",null,null,"英Ⅱ",null,null,null,null,null,null,null,null,null,null,"体育",null,null,null,null,null,null,"体育","英Ⅱ"]
[null,null,null,null,null,null,null,null,null,"杉山  高橋  後藤","杉山  高橋  後藤",null,"小井川  清水ﾀ",null,null,"八木",null,"村山","村山","小井川  清水ﾀ","八木  井上",null,null,"小井川  清水ﾀ",null,null,null,null,null,null,null,null,null,null,"八木  井上",null,null,null,null,null,null,"八木  井上","小井川  清水ﾀ"]
[null,null,null,null,null,null,"2-C","体育","英Ⅱ","芸術","芸術",null,null,null,null,null,null,"体育",null,null,"英Ⅱ",null,null,"家庭","家庭","英Ⅱ","保健",null,null,null,null,"体育",null,null,null,null,null,null,null,null,"英Ⅱ"]
[null,null,null,null,null,null,null,"仙徳  大徳","清水ﾖ 松田","杉山  高橋  後藤","杉山  高橋  後藤",null,null,null,null,null,null,"仙徳  大徳",null,null,"清水ﾖ 松田",null,null,"村山","村山","清水ﾖ 松田","井上",null,null,null,null,"仙徳  大徳",null,null,null,null,null,null,null,null,"清水ﾖ 松田"]
[null,null,null,null,null,null,"2-D","体育","英Ⅱ","家庭","家庭",null,null,null,null,null,null,"体育","保健",null,"英Ⅱ",null,null,null,null,"英Ⅱ",null,null,null,null,null,"体育",null,"芸術","芸術",null,null,null,null,null,"英Ⅱ"]
[null,null,null,null,null,null,null,"仙徳  大徳","清水ﾖ 加藤","村山","村山",null,null,null,null,null,null,"仙徳  大徳","井上",null,"清水ﾖ 加藤",null,null,null,null,"清水ﾖ 加藤",null,null,null,null,null,"仙徳  大徳",null,"高橋  後藤  秦","高橋  後藤  秦",null,null,null,null,null,"清水ﾖ 加藤"]
[null,null,null,null,null,null,"2-E",null,"英Ⅱ",null,null,"保健",null,null,null,"家庭","家庭","英Ⅱ",null,null,null,null,null,null,null,"体育",null,null,"英Ⅱ",null,null,null,null,"芸術","芸術","体育",null,null,null,"体育",null,null,null,null,null,null,null,null,"英Ⅱ"]
[null,null,null,null,null,null,null,null,"清水ﾀ 舘",null,null,"大徳",null,null,null,"寺西","寺西","清水ﾀ 舘",null,null,null,null,null,null,null,"八木  大徳",null,null,"清水ﾀ 舘",null,null,null,null,"高橋  後藤  秦","高橋  後藤  秦","八木  大徳",null,null,null,"八木  大徳",null,null,null,null,null,null,null,null,"清水ﾀ 舘"]
[null,null,null,null,null,null,"2-F",null,"英Ⅱ",null,null,null,null,null,null,null,null,"英Ⅱ",null,null,null,null,null,null,"保健","体育",null,null,"英Ⅱ",null,null,null,null,"芸術","芸術","体育",null,null,null,"体育",null,"家庭","家庭",null,null,null,null,null,"英Ⅱ"]
[null,null,null,null,null,null,null,null,"小井川  清水ﾀ",null,null,null,null,null,null,null,null,"小井川  清水ﾀ",null,null,null,null,null,null,"大徳","八木  大徳",null,null,"小井川  清水ﾀ",null,null,null,null,"高橋  後藤  秦","高橋  後藤  秦","八木  大徳",null,null,null,"八木  大徳",null,"川崎","川崎",null,null,null,null,null,"小井川  清水ﾀ"]
[null,null,null,null,null,null,"2-G",null,null,null,"英Ⅱ","体育",null,null,null,null,null,null,"英Ⅱ","体育",null,null,null,"体育","英Ⅱ",null,"保健",null,null,null,null,"音美","音美",null,null,null,null,null,null,"家庭","家庭",null,null,"英Ⅱ"]
[null,null,null,null,null,null,null,null,null,null,"松田 舘","名児耶  仙徳",null,null,null,null,null,null,"松田 舘","名児耶  仙徳",null,null,null,"名児耶  仙徳","松田 舘",null,"仙徳",null,null,null,null,"後藤    秦","後藤    秦",null,null,null,null,null,null,"川崎","川崎",null,null,"松田 舘"]
[null,null,null,null,null,null,"2-H",null,null,null,"英Ⅱ","体育",null,null,null,null,null,null,"英Ⅱ","体育",null,null,null,"体育","英Ⅱ",null,null,"家庭","家庭",null,null,"音美","音美",null,null,null,null,null,null,null,"保健",null,null,"英Ⅱ"]
[null,null,null,null,null,null,null,null,null,null,"加藤 舘","名児耶  仙徳",null,null,null,null,null,null,"加藤 舘","名児耶  仙徳",null,null,null,"名児耶  仙徳","加藤 舘",null,null,"川崎","川崎",null,null,"後藤    秦","後藤    秦",null,null,null,null,null,null,null,"仙徳",null,null,"加藤 舘"]
[null,null,null,null,null,null,"2-I"]
[]
[null,null,null,null,null,null,"2-J"]
[]
[null,null,null,null,null,null,"2-K"]
[]
[null,null,null,null,null,null,"2-L"]
[]
[null,null,null,null,null,null,"2-M"]
[]
[null,null,null,null,null,null,"2-N"]
[]
[null,null,null,null,null,null,"2-O"]
[]
[null,null,null,null,null,null,"2-P"]
[]
[null,null,null,null,null,null,"2-Q"]
[]
[null,null,null,null,null,null,"2-R"]
[]
[null,null,null,null,null,null,"2-S"]
[]
[null,null,null,null,null,null,"2-T"]
[]
[null,null,null,null,null,null,"3-A","芸術","芸術",null,"体育",null,null,null,null,null,null,"現文",null,null,null,null,null,null,null,null,null,null,null,null,null,"現文","体育",null,null,null,null,null,null,null,"体育","現文"]
[null,null,null,null,null,null,null,"杉山  高橋  後藤","杉山  高橋  後藤",null,"国延  仙徳  山崎  井上",null,null,null,null,null,null,"千田",null,null,null,null,null,null,null,null,null,null,null,null,null,"千田","国延  仙徳  山崎  井上",null,null,null,null,null,null,null,"名児耶 大徳 山崎  井上","千田"]
[null,null,null,null,null,null,"3-B",null,null,"体育",null,null,null,null,null,null,"体育",null,null,null,null,null,null,"芸術","芸術","食物","食物",null,null,null,null,null,null,null,null,null,null,null,null,null,null,null,"体育"]
[null,null,null,null,null,null,null,null,null,"名児耶 大徳 山崎  井上",null,null,null,null,null,null,"八木  仙徳  山崎  井上",null,null,null,null,null,null,"杉山  高橋  後藤","杉山  高橋  後藤","川崎","川崎",null,null,null,null,null,null,null,null,null,null,null,null,null,null,null,"八木  仙徳  山崎  井上"]
[null,null,null,null,null,null,"3-C",null,null,null,null,null,"体育",null,null,null,null,"表現","現文","芸術","芸術",null,null,null,"体育",null,null,null,null,null,null,null,"現文",null,"表現",null,null,null,null,null,"現文",null,null,"体育"]
[null,null,null,null,null,null,null,null,null,null,null,null,"八木  仙徳  山崎  井上",null,null,null,null,"松本ﾔ 山田","千田","杉山  高橋  後藤","杉山  高橋  後藤",null,null,null,"八木  仙徳  山崎  井上",null,null,null,null,null,null,null,"千田",null,"松本ﾔ 山田",null,null,null,null,null,"千田",null,null,"名児耶 大徳 山崎  井上"]
[null,null,null,null,null,null,"3-D",null,"数Ｃ",null,"体育",null,null,null,null,null,null,null,null,null,null,null,null,"芸術","芸術",null,null,"選体","選体",null,null,null,"体育","数Ｃ",null,null,null,null,null,null,"体育"]
[null,null,null,null,null,null,null,null,"菊川   多田",null,"国延  仙徳  山崎  井上",null,null,null,null,null,null,null,null,null,null,null,null,"杉山  高橋  後藤","杉山  高橋  後藤",null,null,"名 国 八 仙 大 山 井","名 国 八 仙 大 山 井",null,null,null,"国延  仙徳  山崎  井上","菊川   多田",null,null,null,null,null,null,"名児耶 大徳 山崎  井上"]
[null,null,null,null,null,null,"3-E",null,null,"体育",null,null,null,null,null,null,"体育",null,null,"芸術","芸術",null,null,null,null,null,"物化",null,null,null,null,null,null,null,null,null,null,null,null,null,null,null,"体育",null,null,null,null,"物化"]
[null,null,null,null,null,null,null,null,null,"名児耶 大徳 山崎  井上",null,null,null,null,null,null,"八木  仙徳  山崎  井上",null,null,"杉山  高橋  後藤","杉山  高橋  後藤",null,null,null,null,null,"関   斉藤ｻ",null,null,null,null,null,null,null,null,null,null,null,null,null,null,null,"八木  仙徳  山崎  井上",null,null,null,null,"関   斉藤ｻ"]
[null,null,null,null,null,null,"3-F","芸術","芸術",null,null,null,"体育",null,null,null,null,null,null,null,null,null,null,null,"体育",null,null,null,null,null,null,null,null,null,null,null,null,null,null,null,null,null,null,"体育"]
[null,null,null,null,null,null,null,"杉山  高橋  後藤","杉山  高橋  後藤",null,null,null,"八木  仙徳  山崎  井上",null,null,null,null,null,null,null,null,null,null,null,"八木  仙徳  山崎  井上",null,null,null,null,null,null,null,null,null,null,null,null,null,null,null,null,null,null,"名児耶 大徳 山崎  井上"]
[null,null,null,null,null,null,"3-G",null,null,null,null,null,"体育",null,null,null,null,null,null,"芸術","芸術",null,null,null,"体育",null,null,null,null,null,null,null,null,null,null,null,null,null,null,"選芸","選芸",null,null,"体育"]
[null,null,null,null,null,null,null,null,null,null,null,null,"八木  仙徳  山崎  井上",null,null,null,null,null,null,"杉山  高橋  後藤","杉山  高橋  後藤",null,null,null,"八木  仙徳  山崎  井上",null,null,null,null,null,null,null,null,null,null,null,null,null,null,"杉山  高橋  後藤","杉山  高橋  後藤",null,null,"名児耶 大徳 山崎  井上"]
[null,null,null,null,null,null,"3-H","芸術","芸術","体育",null,null,null,null,null,null,"体育",null,"表現",null,null,null,null,null,null,null,null,null,null,null,null,null,null,"表現",null,null,null,null,null,null,null,null,"体育"]
[null,null,null,null,null,null,null,"杉山  高橋  後藤","杉山  高橋  後藤","名児耶 大徳 山崎  井上",null,null,null,null,null,null,"八木  仙徳  山崎  井上",null,"関根  山田",null,null,null,null,null,null,null,null,null,null,null,null,null,null,"関根  山田",null,null,null,null,null,null,null,null,"八木  仙徳  山崎  井上"]
[null,null,null,null,null,null,"3-I"]
[]
[null,null,null,null,null,null,"3-J"]
[]
[null,null,null,null,null,null,"3-K"]
[]
[null,null,null,null,null,null,"3-L"]
[]
[null,null,null,null,null,null,"3-M"]
[]
[null,null,null,null,null,null,"3-N"]
[]
[null,null,null,null,null,null,"3-O"]
[]
[null,null,null,null,null,null,"3-P"]
[]
[null,null,null,null,null,null,"3-Q"]
[]
[null,null,null,null,null,null,"3-R"]
[]
[null,null,null,null,null,null,"3-Q"]
[]
[null,null,null,null,null,null,"3-S"]
[]
[null,null,null,null,null,null,"社会科講義室"]
[]
[null,null,null,null,null,null,"物理講義室"]
[]
[null,null,null,null,null,null,"化学講義室"]
[]
[null,null,null,null,null,null,"生物講義室"]
[]
[null,null,null,null,null,null,"地学講義室"]
[]
[null,null,null,null,null,null,"音楽室"]
[]
[null,null,null,null,null,null,"美術室"]
[]
[null,null,null,null,null,null,"書道室"]
[]
[null,null,null,null,null,null,"家庭科室"]
[]
[null,null,null,null,null,null,"ＬＬ教室"]
[]
[null,null,null,null,null,null,"多目的室"]
[]
[null,null,null,null,null,null,"第１多目的室"]
[]
[null,null,null,null,null,null,"第２多目的室"]
[]
[null,null,null,null,null,null,"第３多目的室"]
[]
[null,null,null,null,null,null,"第１セミナー室"]
[]
[null,null,null,null,null,null,"第２セミナー室"]
[]
[null,null,null,null,null,null,"第３セミナー室"]
[]
[null,null,null,null,null,null,"第４セミナー室"]
[]
[null,null,null,null,null,null,"第５セミナー室"]
[]
[null,null,null,null,null,null,"視聴覚室"]
[]
["最終行","最終行","最終行","最終行",null,"最終行","最終行","最終行","最終行","最終行","最終行","最終行","最終行","最終行","最終行","最終行","最終行","最終行","最終行","最終行","最終行","最終行","最終行","最終行","最終行","最終行","最終行","最終行","最終行","最終行","最終行","最終行","最終行","最終行","最終行","最終行","最終行","最終行","最終行","最終行","最終行","最終行","最終行","最終行","最終行","最終行","最終行","最終行","最終行","最終行","最終行","最終行","最終行","最終行"]

{"sheet":"特別教室コード・表示内容変更","index":3,"n_rows":26,"n_cols":5,"rows_kept":26,"cut":false,"hidden":false,"merged":[[24,4,24,5],[25,4,25,5],[20,4,20,5],[21,4,21,5],[22,4,22,5],[23,4,23,5],[16,4,16,5],[17,4,17,5],[18,4,18,5],[19,4,19,5],[12,4,12,5],[13,4,13,5],[14,4,14,5],[15,4,15,5],[8,4,8,5],[9,4,9,5],[10,4,10,5],[11,4,11,5],[3,2,3,5],[5,4,5,5],[6,4,6,5],[7,4,7,5]]}
[]
[]
[]
[null,null,"特別教室コード・表示内容変更"]
[]
[null,null,"ＮＯ","コード","呼出表示"]
[null,null,1,"sykkgst","社会科講義室"]
[null,null,2,"btrkgst","物理講義室"]
[null,null,3,"kgkkgst","化学講義室"]
[null,null,4,"sbtkgst","生物講義室"]
[null,null,5,"tgkkgst","地学講義室"]
[null,null,6,"ogkkgst","音楽室"]
[null,null,7,"bjgst","美術室"]
[null,null,8,"sdkgst","書道室"]
[null,null,9,"ktkkgst","家庭科室"]
[null,null,10,"llkyst","ＬＬ教室"]
[null,null,11,"tmktkst","多目的室"]
[null,null,12,"d1tmktkst","第１多目的室"]
[null,null,13,"d2tmktkst","第２多目的室"]
[null,null,14,"d3tmktkst","第３多目的室"]
[null,null,15,"d1smnst","第１セミナー室"]
[null,null,16,"d2smnst","第２セミナー室"]
[null,null,17,"d3smnst","第３セミナー室"]
[null,null,18,"d4smnst","第４セミナー室"]
[null,null,19,"d5smnst","第５セミナー室"]
[null,null,20,"stykkst","視聴覚室"]

{"sheet":"インターフェース画面設定","index":4,"n_rows":7,"n_cols":4,"rows_kept":7,"cut":false,"hidden":false,"merged":[]}
[]
[]
[null,null,"インターフェース画面設定"]
[null,null,"項目","設定値"]
[null,null,"画面高さ",810]
[null,null,"画面幅",1440]
[null,null,"画面Zoom",216]

{"sheet":"呼出ファイル","index":5,"n_rows":9,"n_cols":4,"rows_kept":9,"cut":false,"hidden":false,"merged":[]}
[]
[]
[null,"      呼出ファイルのドライブ・ディレクトリー位置及びファイル名"]
[]
[null,"変数区分","DriveDirectoryName","FileName"]
[null,"Jhs","D:\\時間割編成システム64ビット版漢字変換へ\\2010週46時間対応210人60クラス入力版新版(アルファベット入力あり)\\３台登録用\\３台登録処理ツール","210人60クラス時間割システム3台登録Ver1.xlsm"]
[null,"Jhsk","D:\\時間割編成システム64ビット版漢字変換へ\\2010週46時間対応210人60クラス入力版新版(アルファベット入力あり)\\３台登録用\\３台登録処理ツール","210人60クラス時間割システム簡易版3台登録Ver1.xlsm"]
[null,"Jkns","D:\\時間割編成システム64ビット版漢字変換へ\\2010週46時間対応210人60クラス入力版新版(アルファベット入力あり)\\３台登録用\\３台登録処理ツール","210人60クラスコマ入力システム3台登録Ver1.xlsm"]
[null,"Jhss","D:\\時間割編成システム64ビット版漢字変換へ\\2010週46時間対応210人60クラス入力版新版(アルファベット入力あり)\\３台登録用\\３台登録処理ツール","210人60クラス時間割システム制御3台登録Ver1.xlsm"]